{"text_format":"1","workbook":"xlsx","n_sheets":19,"sheets":["入力シート","パーソナルプラン表紙（１）","２","３","４","５","6","7","8","9","10","11","12","13","14","15","16","17","個別避難計画様式"],"not_rendered":{"charts":0,"images":1,"macros":1,"external_links":0,"defined_names":20,"comments":1,"pivot_tables":0},"unopened":[],"bounds":{"document_bytes":16777216,"sheet_cells":100000,"rows_first":2000,"rows_last":500,"rows_between":2000,"halvings":0,"cell_chars":16384,"cell_head_chars":4096},"cells_cut":0,"cells_raw":0,"read":"whole","date_system":"1900"}

{"sheet":"入力シート","index":0,"n_rows":291,"n_cols":23,"rows_kept":291,"cut":false,"hidden":false,"merged":[[119,9,119,10],[284,0,286,20],[284,21,286,22],[143,1,143,2],[126,9,126,10],[127,9,127,10],[126,5,126,6],[126,11,126,12],[126,13,126,16],[127,5,127,6],[127,11,127,12],[127,13,127,16],[129,1,129,2],[130,1,130,2],[131,1,131,2],[132,1,132,2],[133,1,133,2],[142,1,142,2],[261,0,261,2],[252,0,252,2],[252,3,252,22],[253,0,253,2],[253,3,253,22],[236,0,236,22],[212,20,212,22],[101,0,101,2],[102,0,102,2],[103,3,103,10],[103,11,103,13],[103,14,103,16],[103,17,103,22],[103,0,104,2],[104,3,104,16],[122,7,122,8],[122,9,122,10],[106,5,106,8],[106,10,106,11],[106,12,106,22],[122,17,122,19],[122,20,122,22],[120,11,120,12],[120,13,120,14],[120,21,120,22],[119,3,119,8],[119,11,119,14],[119,15,119,22],[120,15,120,20],[119,0,119,2],[202,0,203,2],[204,0,208,2],[201,5,201,13],[202,5,202,13],[203,5,203,13],[209,0,213,2],[214,0,217,2],[216,14,216,16],[216,17,216,19],[213,14,213,16],[213,17,213,19],[213,5,213,13],[210,14,210,16],[210,17,210,19],[211,14,211,16],[211,17,211,19],[212,14,212,16],[212,17,212,19],[194,0,201,2],[223,5,223,13],[238,0,238,21],[249,0,249,2],[218,0,232,2],[130,15,130,22],[131,3,131,8],[132,3,132,8],[133,3,133,8],[255,0,255,2],[254,3,254,22],[255,3,255,22],[144,1,144,2],[145,1,145,2],[146,1,146,2],[147,1,147,2],[148,1,148,2],[134,1,134,2],[135,1,135,2],[136,1,136,2],[137,1,137,2],[138,1,138,2],[139,1,139,2],[140,1,140,2],[141,1,141,2],[235,0,235,22],[234,0,234,22],[259,0,259,2],[259,3,259,22],[260,0,260,2],[260,3,260,22],[242,3,242,22],[243,0,243,2],[243,3,243,22],[244,0,244,2],[244,3,244,22],[245,0,245,2],[245,3,245,22],[246,0,246,2],[246,3,246,22],[240,0,240,2],[240,3,240,22],[241,0,241,2],[241,3,241,22],[256,3,256,22],[265,0,265,2],[265,3,265,22],[247,0,247,2],[247,3,247,22],[248,0,248,2],[248,3,248,22],[250,0,250,2],[250,3,250,22],[251,0,251,2],[251,3,251,22],[256,0,256,2],[257,0,257,2],[257,3,257,22],[258,0,258,2],[258,3,258,22],[249,3,249,22],[262,0,262,2],[263,0,263,2],[263,3,263,22],[264,0,264,2],[264,3,264,22],[261,3,261,22],[262,3,262,22],[254,0,254,2],[179,14,179,16],[186,14,186,16],[186,17,186,19],[186,20,186,22],[224,5,224,13],[225,5,225,13],[230,5,230,13],[231,5,231,13],[214,20,214,22],[215,14,215,16],[215,17,215,19],[215,20,215,22],[222,5,222,13],[214,5,214,13],[215,5,215,13],[216,5,216,13],[217,5,217,13],[218,5,218,13],[219,5,219,13],[220,5,220,13],[221,5,221,13],[225,17,225,19],[225,20,225,22],[221,14,221,16],[198,5,198,13],[199,5,199,13],[200,5,200,13],[195,5,195,9],[195,11,195,13],[196,5,196,10],[196,11,196,13],[195,20,195,22],[184,17,184,19],[184,20,184,22],[191,5,191,13],[191,14,191,16],[191,17,191,19],[191,20,191,22],[192,5,192,13],[192,14,192,16],[192,17,192,19],[192,20,192,22],[191,0,192,2],[157,14,157,16],[157,17,157,19],[170,17,170,19],[170,14,170,16],[181,14,181,16],[181,17,181,19],[181,20,181,22],[156,0,175,1],[167,2,175,2],[156,2,166,2],[176,0,186,1],[179,17,179,19],[179,20,179,22],[180,5,180,13],[185,5,185,13],[185,14,185,16],[185,17,185,19],[185,20,185,22],[186,5,186,13],[173,5,173,9],[173,11,173,13],[173,14,173,16],[173,17,173,19],[187,0,190,2],[180,14,180,16],[180,17,180,19],[180,20,180,22],[181,2,186,2],[181,5,181,13],[182,5,182,10],[182,11,182,12],[182,14,182,16],[182,17,182,19],[182,20,182,22],[183,5,183,10],[183,11,183,12],[183,14,183,16],[183,17,183,19],[183,20,183,22],[184,5,184,13],[184,14,184,16],[187,14,187,16],[187,17,187,19],[187,20,187,22],[188,5,188,13],[175,5,175,10],[175,11,175,13],[175,14,175,16],[175,17,175,19],[175,20,175,22],[176,5,176,13],[176,14,176,16],[176,17,176,19],[176,20,176,22],[177,5,177,10],[177,11,177,12],[177,14,177,16],[177,17,177,19],[177,20,177,22],[178,5,178,13],[178,14,178,16],[178,17,178,19],[178,20,178,22],[187,5,187,13],[179,5,179,13],[190,5,190,13],[190,14,190,16],[190,17,190,19],[190,20,190,22],[188,14,188,16],[188,17,188,19],[188,20,188,22],[189,5,189,13],[189,14,189,16],[189,17,189,19],[189,20,189,22],[174,5,174,10],[174,11,174,13],[174,14,174,16],[174,17,174,19],[174,20,174,22],[170,5,170,13],[170,20,170,22],[171,5,171,10],[171,11,171,12],[171,14,171,16],[171,17,171,19],[171,20,171,22],[172,5,172,10],[172,11,172,12],[172,14,172,16],[172,17,172,19],[172,20,172,22],[173,20,173,22],[158,5,158,10],[158,11,158,12],[159,5,159,10],[159,11,159,12],[165,5,165,13],[165,14,165,16],[165,17,165,19],[165,20,165,22],[166,5,166,13],[166,14,166,16],[166,17,166,19],[166,20,166,22],[160,5,160,13],[163,5,163,13],[164,5,164,13],[163,14,163,16],[164,14,164,16],[204,5,204,13],[205,5,205,13],[206,5,206,13],[207,5,207,13],[208,5,208,13],[209,5,209,13],[210,5,210,13],[211,5,211,13],[212,5,212,13],[232,5,232,13],[226,5,226,13],[226,14,226,16],[226,17,226,19],[226,20,226,22],[227,5,227,13],[227,14,227,16],[227,17,227,19],[227,20,227,22],[228,5,228,13],[228,14,228,16],[228,17,228,19],[228,20,228,22],[229,5,229,13],[229,14,229,16],[231,14,231,16],[231,17,231,19],[231,20,231,22],[229,17,229,19],[229,20,229,22],[232,14,232,16],[232,17,232,19],[232,20,232,22],[219,17,219,19],[219,20,219,22],[220,14,220,16],[220,17,220,19],[220,20,220,22],[223,14,223,16],[196,14,196,16],[196,17,196,19],[196,20,196,22],[197,14,197,16],[197,17,197,19],[197,20,197,22],[198,14,198,16],[198,17,198,19],[198,20,198,22],[222,20,222,22],[221,17,221,19],[221,20,221,22],[222,14,222,16],[222,17,222,19],[206,20,206,22],[216,20,216,22],[213,20,213,22],[210,20,210,22],[160,14,160,16],[161,14,161,16],[160,17,160,19],[160,20,160,22],[163,17,163,19],[163,20,163,22],[199,14,199,16],[199,17,199,19],[199,20,199,22],[193,0,193,21],[167,5,167,13],[167,14,167,16],[167,17,167,19],[167,20,167,22],[168,5,168,10],[168,11,168,12],[168,14,168,16],[168,17,168,19],[168,20,168,22],[169,5,169,10],[169,11,169,12],[169,14,169,16],[169,17,169,19],[169,20,169,22],[230,14,230,16],[230,17,230,19],[230,20,230,22],[206,17,206,19],[217,14,217,16],[200,14,200,16],[200,17,200,19],[200,20,200,22],[201,14,201,16],[201,17,201,19],[201,20,201,22],[202,14,202,16],[202,17,202,19],[202,20,202,22],[217,17,217,19],[217,20,217,22],[223,17,223,19],[223,20,223,22],[224,14,224,16],[224,17,224,19],[224,20,224,22],[225,14,225,16],[206,14,206,16],[219,14,219,16],[218,14,218,16],[218,17,218,19],[218,20,218,22],[203,14,203,16],[203,17,203,19],[203,20,203,22],[204,14,204,16],[204,17,204,19],[204,20,204,22],[205,14,205,16],[205,17,205,19],[205,20,205,22],[207,14,207,16],[207,17,207,19],[207,20,207,22],[208,14,208,16],[208,17,208,19],[208,20,208,22],[209,14,209,16],[209,17,209,19],[209,20,209,22],[214,14,214,16],[214,17,214,19],[211,20,211,22],[195,14,195,16],[195,17,195,19],[156,5,156,13],[156,14,156,16],[156,17,156,19],[156,20,156,22],[158,17,158,19],[158,20,158,22],[159,17,159,19],[159,20,159,22],[157,5,157,13],[164,17,164,19],[164,20,164,22],[194,14,194,16],[194,5,194,13],[161,17,161,19],[161,20,161,22],[162,5,162,13],[162,14,162,16],[162,17,162,19],[162,20,162,22],[157,20,157,22],[158,14,158,16],[159,14,159,16],[197,5,197,13],[148,15,148,22],[148,11,148,14],[147,9,147,10],[144,9,144,10],[145,9,145,10],[146,9,146,10],[148,9,148,10],[155,0,155,21],[194,17,194,19],[194,20,194,22],[145,3,145,8],[146,3,146,8],[176,2,180,2],[151,15,151,22],[150,15,150,22],[149,15,149,22],[149,0,154,2],[148,3,148,8],[147,3,147,8],[153,3,153,10],[154,3,154,10],[153,11,153,14],[154,11,154,14],[154,15,154,22],[138,11,138,14],[139,11,139,14],[145,11,145,14],[146,11,146,14],[147,11,147,14],[131,15,131,22],[132,15,132,22],[133,15,133,22],[134,15,134,22],[135,15,135,22],[136,15,136,22],[137,15,137,22],[138,15,138,22],[139,15,139,22],[145,15,145,22],[146,15,146,22],[147,15,147,22],[143,15,143,22],[144,15,144,22],[142,11,142,14],[143,11,143,14],[144,11,144,14],[134,3,134,8],[135,3,135,8],[135,11,135,14],[136,11,136,14],[137,11,137,14],[130,11,130,14],[153,15,153,22],[152,15,152,22],[149,3,149,10],[149,11,149,14],[150,3,150,10],[151,3,151,8],[151,9,151,10],[150,11,150,14],[151,11,151,14],[152,3,152,10],[152,11,152,14],[140,9,140,10],[140,11,140,14],[140,15,140,22],[141,9,141,10],[141,11,141,14],[141,15,141,22],[143,9,143,10],[142,9,142,10],[140,3,140,8],[141,3,141,8],[142,3,142,8],[143,3,143,8],[144,3,144,8],[129,3,129,8],[129,11,129,14],[129,15,129,22],[142,15,142,22],[131,9,131,10],[132,9,132,10],[133,9,133,10],[134,9,134,10],[135,9,135,10],[136,9,136,10],[137,9,137,10],[138,9,138,10],[139,9,139,10],[131,11,131,14],[132,11,132,14],[133,11,133,14],[134,11,134,14],[136,3,136,8],[137,3,137,8],[138,3,138,8],[139,3,139,8],[130,3,130,8],[130,9,130,10],[126,1,126,4],[127,1,127,4],[121,0,121,21],[128,0,128,21],[129,9,129,10],[126,20,126,22],[127,20,127,22],[123,17,123,19],[124,17,124,19],[125,17,125,19],[126,17,126,19],[127,17,127,19],[123,7,123,8],[124,7,124,8],[125,7,125,8],[126,7,126,8],[127,7,127,8],[123,9,123,10],[124,9,124,10],[122,13,122,16],[123,5,123,6],[123,11,123,12],[123,13,123,16],[122,1,122,4],[123,1,123,4],[123,20,123,22],[124,20,124,22],[125,20,125,22],[124,5,124,6],[124,11,124,12],[124,13,124,16],[125,5,125,6],[125,11,125,12],[125,13,125,16],[125,9,125,10],[115,0,115,2],[115,3,115,22],[118,0,118,2],[118,3,118,22],[116,0,116,2],[116,3,116,22],[117,0,117,2],[117,3,117,22],[114,0,114,2],[114,11,114,12],[114,13,114,14],[114,3,114,10],[114,15,114,22],[68,17,68,22],[66,3,67,4],[68,3,69,4],[71,5,71,10],[71,11,71,16],[71,17,71,22],[79,3,79,18],[78,19,78,20],[69,5,69,10],[69,11,69,16],[76,3,77,10],[78,3,78,10],[78,11,78,13],[76,11,77,13],[76,14,77,18],[76,19,77,20],[76,21,77,21],[76,22,77,22],[78,14,78,18],[78,21,78,22],[72,0,72,22],[69,17,69,22],[82,9,82,10],[82,11,82,12],[82,13,82,14],[82,15,82,18],[79,0,80,2],[82,19,82,20],[82,21,82,22],[81,11,81,12],[81,13,81,14],[81,15,81,18],[81,19,81,20],[81,21,81,22],[105,21,105,22],[107,10,107,11],[107,12,107,22],[80,5,80,18],[91,3,91,10],[91,11,91,13],[91,14,91,16],[90,17,90,19],[90,3,90,10],[87,3,87,10],[87,11,87,13],[87,14,87,16],[87,17,87,19],[98,11,98,22],[99,3,99,10],[99,11,99,13],[99,20,99,22],[100,3,100,10],[100,11,100,13],[100,20,100,22],[99,14,99,19],[100,14,100,19],[283,0,283,22],[54,3,56,22],[57,3,58,22],[59,3,61,22],[41,3,43,22],[26,3,28,22],[34,3,35,22],[36,3,38,22],[11,3,13,22],[67,17,67,22],[46,0,46,21],[45,0,45,22],[64,3,64,4],[64,5,64,10],[64,11,64,16],[64,17,64,22],[14,3,15,22],[16,3,18,22],[29,3,30,22],[31,3,33,22],[39,3,40,22],[9,0,43,2],[82,0,82,2],[107,5,107,8],[290,0,291,22],[239,0,239,21],[242,0,242,2],[122,5,122,6],[0,18,0,22],[1,18,1,22],[1,13,1,17],[0,13,0,17],[78,0,78,2],[74,0,75,2],[74,3,75,10],[75,11,75,13],[75,14,75,22],[74,11,74,16],[76,0,77,2],[79,19,79,20],[79,21,79,22],[80,3,80,4],[80,19,80,20],[80,21,80,22],[81,0,81,2],[81,3,81,4],[81,5,81,8],[81,9,81,10],[86,3,86,10],[86,11,86,13],[83,21,83,22],[82,3,82,4],[82,5,82,8],[86,14,86,16],[86,17,86,19],[85,0,85,2],[86,0,91,2],[85,3,85,9],[85,10,85,12],[85,13,85,18],[85,19,85,22],[83,0,83,2],[83,3,83,4],[83,5,83,8],[83,9,83,10],[83,11,83,12],[83,13,83,14],[83,15,83,18],[83,19,83,20],[96,3,96,10],[96,11,96,13],[96,14,96,16],[90,11,90,13],[92,0,92,2],[92,3,92,22],[86,20,86,22],[87,20,87,22],[88,20,88,22],[89,20,89,22],[90,20,90,22],[91,20,91,22],[91,17,91,19],[88,3,88,10],[88,11,88,13],[88,14,88,16],[88,17,88,19],[89,3,89,10],[89,11,89,13],[89,14,89,16],[89,17,89,19],[90,14,90,16],[94,3,94,10],[94,11,94,13],[94,14,94,16],[95,3,95,10],[95,11,95,13],[95,14,95,16],[97,3,97,10],[97,11,97,13],[97,14,97,16],[266,0,266,21],[267,0,267,2],[267,3,267,8],[161,5,161,13],[109,3,109,4],[109,5,109,11],[109,13,109,21],[110,5,110,10],[110,11,110,22],[110,3,110,4],[113,15,113,22],[113,13,113,14],[112,9,112,10],[112,3,112,8],[112,11,112,14],[111,3,111,4],[111,5,111,8],[120,0,120,2],[120,3,120,4],[120,5,120,8],[120,9,120,10],[280,0,280,2],[281,0,281,2],[279,3,279,22],[280,3,280,22],[281,3,281,22],[278,0,278,2],[267,9,267,14],[268,9,268,14],[269,9,269,14],[270,9,270,14],[271,9,271,14],[272,9,272,14],[273,9,273,14],[274,9,274,14],[275,0,275,21],[276,3,276,22],[277,3,277,22],[124,1,124,4],[125,1,125,4],[122,11,122,12],[278,3,278,22],[276,0,276,2],[277,0,277,2],[274,0,274,2],[274,3,274,8],[274,15,274,22],[272,0,272,2],[271,15,271,22],[267,15,267,22],[268,0,268,2],[268,3,268,8],[268,15,268,22],[269,0,269,2],[269,3,269,8],[269,15,269,22],[111,0,112,2],[105,0,110,2],[113,0,113,2],[113,3,113,4],[113,5,113,8],[113,9,113,10],[113,11,113,12],[111,15,111,18],[111,19,111,20],[111,9,111,10],[111,11,111,12],[111,13,111,14],[105,5,105,8],[105,11,105,12],[105,13,105,14],[105,15,105,18],[105,19,105,20],[108,3,108,4],[108,5,108,22],[4,14,4,16],[4,17,4,19],[4,20,4,21],[5,0,6,2],[5,3,6,10],[5,11,5,16],[6,11,6,13],[6,14,6,22],[237,0,237,22],[233,0,233,22],[111,21,111,22],[105,3,107,4],[93,0,93,2],[93,3,93,22],[94,17,94,22],[95,17,95,22],[96,17,96,22],[97,17,97,22],[98,3,98,10],[101,3,101,10],[101,11,101,13],[101,14,101,16],[101,17,101,22],[94,0,100,2],[73,0,73,2],[73,3,73,10],[73,11,73,13],[73,14,73,16],[73,17,73,19],[73,20,73,21],[2,0,2,2],[2,3,2,10],[2,17,2,19],[2,20,2,21],[2,11,2,12],[2,13,2,16],[7,0,7,22],[47,0,61,2],[63,3,63,4],[63,5,63,10],[63,11,63,16],[63,17,63,22],[47,3,48,22],[49,3,51,22],[3,18,3,22],[4,0,4,2],[4,3,4,10],[4,11,4,13],[8,0,8,21],[70,5,70,10],[70,11,70,16],[70,17,70,22],[70,3,71,4],[67,11,67,16],[65,3,65,4],[65,5,65,10],[65,11,65,16],[65,17,65,22],[19,3,20,22],[21,3,23,22],[24,3,25,22],[44,0,44,22],[62,0,62,21],[52,3,53,22],[63,0,65,2],[66,5,66,10],[66,11,66,16],[66,17,66,22],[67,5,67,10],[9,3,10,22],[68,5,68,10],[68,11,68,16],[287,0,289,20],[287,21,289,22],[84,0,84,2],[84,10,84,12],[84,3,84,9],[84,13,84,18],[84,19,84,22],[279,0,279,2],[272,3,272,8],[272,15,272,22],[273,0,273,2],[273,3,273,8],[273,15,273,22],[270,0,270,2],[270,3,270,8],[270,15,270,22],[271,0,271,2],[271,3,271,8],[104,17,104,22],[102,3,102,10],[102,11,102,13],[102,14,102,16],[102,17,102,22],[112,15,112,22]]}
[null,null,null,null,null,null,null,null,null,null,null,null,null,"作成日",null,null,null,null,"令和2　年　8　月　27　日"]
[null,null,null,null,null,null,null,null,null,null,null,null,null,"次回見直し時期",null,null,null,null,"令和3 　年　2　月　　日"]
["作成事業所",null,null,"岡山市",null,null,null,null,null,null,null,"作成者",null,"岡山",null,null,null,"作成区分",null,null,"新規"]
["【１】対象者基本情報（必須）"]
["ふりがな",null,null,"おかやま　ももたろう",null,null,null,null,null,null,null,"性    　別",null,null,"男",null,null,"年   　齢",null,null,40,null,"歳"]
["氏　名",null,null,"岡山　桃太郎",null,null,null,null,null,null,null,"生年月日　（西暦）",null,null,null,null,null,1985,"年",4,"月",2,"日"]
[null,null,null,null,null,null,null,null,null,null,null,"住所",null,null,"〒７００－××××　　　岡山市〇区"]
["P１：顔写真を貼り付ける項目があります。（任意）"]
["【２】　自宅付近のハザード情報（自然災害の危険予測）（任意）\n＝自宅は次の被害が想定されています＝"]
["災害のリスク\n（任意）",null,null,"地　　震"]
[]
[null,null,null,"南海トラフ地震の最大震度は震度６強の予想。マンション7階のため（耐震化あり）、\n地震時の揺れは強く、液状化現象が起こる可能性あり"]
[]
[]
[null,null,null,"津　　波"]
[]
[null,null,null,"津波発生時、０．５メートル～1メートルの浸水被害の危険あり"]
[]
[]
[null,null,null,"土砂災害"]
[]
[null,null,null,"なし"]
[]
[]
[null,null,null,"洪　　水（河川等の氾濫）"]
[]
[null,null,null,"洪水時、０．５メートルの浸水被害の危険あり"]
[]
[]
[null,null,null,"大雨による浸水（下水道で雨水を処理できなくなり浸水すること）"]
[]
[null,null,null,"大雨の時、０．５メートルの浸水被害の危険あり"]
[]
[]
[null,null,null,"台　　風"]
[]
[null,null,null,"停電の可能性あり"]
[]
[]
[null,null,null,"そ  の  他"]
[]
[]
[]
[]
["【３】☆　自宅周辺の地図を貼り付け、避難経路、危険な場所や避難場所等を記載しましょう。"]
["P３には、地図などを貼り付ける項目があります。（任意）"]
["【４】　いざという時の動き（停電の場合）　（必須）"]
["停電の場合\n（必須）",null,null,"電源が必要な機器（非常用電源で人工呼吸器が稼働できる時間）"]
[]
[null,null,null,"人工呼吸器、吸引器、加温加湿器　\n非常用電源で約７時間稼働可"]
[]
[]
[null,null,null,"電源確保の方法（誰が、何を使って、どうやって）"]
[]
[null,null,null,"・基本的に外部バッテリーの稼働時間（約7時間）以内に避難する。垂直避難の場合は、自家用車からインバーターに接続し外部バッテリーを充電しながら人工呼吸器を稼働させる。\n・医療機関、レスパイト先、母方実家など避難先の確認。\n・福祉避難所（電源確保が可能なところ、また、2号線バイパスより北側）の確認。"]
[]
[]
[null,null,null,"災害時、１番に連絡する人"]
[]
[null,null,null,"医療機器メーカー、訪問看護ステーションY、祖父母"]
[]
[]
["【５】【６】　いざという時の動き（災害リスクに合わせた連絡方法、避難先、避難の手順）（必須）"]
["避難が必要な\n場合\n（必須）",null,null,"避難が必要な状況１（大雨）",null,"大雨警戒レベル3以上や停電が長引く場合",null,null,null,null,null,"避難をしたら、居場所をだれに伝えるか",null,null,null,null,null,"医療機器メーカー、訪問看護ステーションY、祖父母"]
[null,null,null,"避難が必要な状況２（台風）",null,"大型台風が予測され警戒レベル３以上の場合",null,null,null,null,null,"避難をしたら、居場所をだれに伝えるか",null,null,null,null,null,"医療機器メーカー、訪問看護ステーションY、祖父母"]
[null,null,null,"避難が必要な状況３（地震・津波）",null,"自宅マンションの倒壊などで避難が必要な場合",null,null,null,null,null,"避難をしたら、居場所をだれに伝えるか",null,null,null,null,null,"医療機器メーカー、訪問看護ステーションY、祖父母"]
["大雨","台風","地震・津波","避難先\n候補①",null,"【避難先・住所】",null,null,null,null,null,"【受付担当者・担当部署】",null,null,null,null,null,"【移動方法】"]
[null,null,1,null,null,"K病院\n岡山市北区〇〇",null,null,null,null,null,"地域連携室Aさん",null,null,null,null,null,"エレベーターが使用できないことが想定されるため、階段までは桃太郎君をバギーに乗せ、階段は以下のとおり4人で介助して１階まで降りる。\n二人でバギーに吸引器、呼吸器等をのせたまま本人の先を降りる。桃太郎くんを一人で横抱きにして、もう一人がサポートしながらバギーに続いて降りる（途中で吸引が必要になる可能性あり）。桃太郎君を抱いて移動する際はバギング不要。カニューレに人工鼻（サーモベントT）を装着。\n車に乗車し移動。道路状況を確認して経路を考える。車が使用できない時の方法の検討が必要。また、浸水被害を考え、車を安全な場所に移動しておくことが必要。"]
[null,null,null,"避難先\n候補②",null,"【避難先・住所】",null,null,null,null,null,"【受付担当者・担当部署】",null,null,null,null,null,"【移動方法】"]
[null,1,null,null,null,"C施設\n岡山市北区〇〇",null,null,null,null,null,"Bさん",null,null,null,null,null,"ベッドから車までは、避難先①と同じ。\n車に乗車し移動。大雨の場合は、〇川が氾濫している恐れがある。災害状況を確認する。"]
[null,null,null,"避難先\n候補③",null,"【避難先・住所】",null,null,null,null,null,"【受付担当者・担当部署】",null,null,null,null,null,"【移動方法】"]
[1,null,null,null,null,"〇ふれあいセンター\n岡山市〇区〇〇",null,null,null,null,null,null,null,null,null,null,null,"ベッドから車までは、避難先①と同じ。\n車に乗車し移動。\n車が使用できない場合は、バギーに乗せて移動する。"]
["【７】　緊急連絡用カード　（必須）"]
["ふりがな",null,null,{"$f":"D5","v":"おかやま　ももたろう"},null,null,null,null,null,null,null,"性    　別",null,null,{"$f":"O5","v":"男"},null,null,"年   　齢",null,null,{"$f":"U5","v":40},null,"歳"]
["氏　名",null,null,{"$f":"D6","v":"岡山　桃太郎"},null,null,null,null,null,null,null,"生年月日",null,null,null,null,null,{"$f":"R6","v":1985},"年",{"$f":"T6","v":4},"月",{"$f":"V6","v":2},"日"]
[null,null,null,null,null,null,null,null,null,null,null,"血液型A・B・O・AB　（Rh：＋・－）",null,null,"A"]
["住　所",null,null,{"$f":"O7","v":"〒７００－××××　　　岡山市〇区"},null,null,null,null,null,null,null,"住まいの状況",null,null,"戸建て・集合住宅",null,null,null,null,"戸建て",null,"階",2]
[]
["本人連絡先",null,null,"０８６－２××－××××（自宅）",null,null,null,null,null,null,null,"指定難病医療受給者証の有無",null,null,"有",null,null,null,null,"認知症有無",null,"有"]
["病名",null,null,"ALS",null,null,null,null,null,null,null,null,null,null,null,null,null,null,null,"発病年月",null,"H10年８月"]
[null,null,null,"合併症",null,"1999年筋生検（先天性筋ジストロフィー症、2014年（側弯症）脊椎固定術、（嚥下困難）胃ろう造設術、2016年（窒息による低酸素脳症）気管切開、腕頭動脈離断術、2017年喉頭気管分離術",null,null,null,null,null,null,null,null,null,null,null,null,null,"呼吸器装着年月",null,"H29年８月"]
["障害者手帳",null,null,"有無",null,"有",null,null,null,"身体手帳\n等級",null,"1級",null,"精神手帳\n等級",null,"1級",null,null,null,"療育手帳",null,"A"]
["介護保険",null,null,"有無",null,"有",null,null,null,"要支援度",null,null,null,"要介護度",null,3,null,null,null,"障害支援区分",null,5]
["移動",null,null,"自立有無",null,"全介助",null,null,null,"杖・歩行器使用",null,"無",null,"車いす使用",null,"無",null,null,null,"担架・ストレッチャー使用",null,"有"]
["視力",null,null,"見える・見えにくい・見えない",null,null,null,null,null,null,"見えにくい",null,null,"眼鏡・コンタクト使用",null,null,null,null,null,"無"]
["聴力",null,null,"聞こえる・聞こえにくい・聞こえない",null,null,null,null,null,null,"聞こえにくい",null,null,"補聴器使用",null,null,null,null,null,"無"]
["薬",null,null,"薬剤名",null,null,null,null,null,null,null,"１日量",null,null,"服薬回数",null,"服薬回数","服薬時間","服薬回数",null,"備考"]
[]
[]
[]
[]
[]
["禁忌薬品",null,null,"なし。抗生物質が入ると下痢になりやすい。鎮静をかけた時などは尿閉がおこる。"]
["アレルギー",null,null,"なし。"]
["使用中の医療機器",null,null,"・人工呼吸器　　メーカー名・製品名",null,null,null,null,null,null,null,"アストラル\n（鬼ヶ島）　",null,null,"メ－カー連絡先",null,"服薬回数"]
[null,null,null,"・吸引器　　　　　製品名：　",null,null,null,null,null,null,null,"ミニックDCⅡ\n（工業株式会社）　",null,null,"メ－カー連絡先",null,"服薬回数"]
[null,null,null,"・ネブライザー　　製品名：",null,null,null,null,null,null,null,null,null,null,"メ－カー連絡先",null,"服薬回数"]
[null,null,null,"・酸素療法　　　　製品名：",null,null,null,null,null,null,null,null,null,null,"メ－カー連絡先",null,"服薬回数"]
[null,null,null,"（常時・夜間のみ）　",null,null,null,null,null,null,null,"常時"]
[null,null,null,"安静時：吸入量　　　　（ℓ／分）　",null,null,null,null,null,null,null,null,null,null,"吸入時間（時間／日）　"]
[null,null,null,"労作時：吸入量　　　　（ℓ／分）",null,null,null,null,null,null,null,null,null,null,"吸入時間（時間／日）"]
["呼吸\n",null,null,"1回換気量　　　　ml",null,null,null,null,null,null,null,"２５０～３５０ｍｌ",null,null,"呼吸回数　　",null,"服薬回数","１４回"]
["（人工呼吸器使用\n状況）",null,null,"離脱の可否　",null,null,null,null,null,null,null,"可",null,null,"離脱可能時間（分）　　",null,"服薬回数","６０分"]
["夜間のみ",null,null,"気管カニューレ　　製品名：",null,null,null,null,null,null,null,"A気管切開チューブ\n（オールシリコーン,ストレート型）",null,null,"サイズ（mm）",null,"服薬回数","内径9.0 ㎜ 外径12.3㎜37F"]
[null,null,null,"（カフ付き気管カニューレの場合）カフ圧cmH2O",null,null,null,null,null,null,null,null,null,null,null,null,null,"２７～２８"]
["栄　養",null,null,"摂取方法",null,"胃ろう有無",null,null,null,"有","（ボタン・チューブ）","ボタン",null,"（バルーン・バンパー）",null,"バルーン",null,null,null,"バルーンの\n固定水（㎖）"]
[null,null,null,null,null,"経鼻経管有無",null,null,null,null,"サイズ・種類"]
[null,null,null,null,null,"固定位置の深さ",null,null,null,null,"その他"]
[null,null,null,"種類",null,"ミキサー食、メイバランス"]
[null,null,null,"量",null,"３００～３５０",null,null,null,null,null,null,"ml/回",3,null,null,null,null,null,null,null,null,"回/日"]
[null,null,null,"方法",null,"（シリンジ・注入ポンプ）",null,null,null,null,null,"シリンジ"]
["排泄",null,null,"トイレ",null,"全介助",null,null,null,"おむつ",null,"使用",null,"導尿（回/日）",null,null,null,null,null,"浣腸（回/日）"]
[null,null,null,"ストーマ有無",null,null,null,null,null,"無",null,"交換頻度（回/日）"]
["コミュニケーション",null,null,"会話可否",null,"否",null,null,null,"筆談可否",null,"否",null,"文字盤可否",null,"否"]
[null,null,null,"意思伝達措置可否",null,null,null,null,null,null,null,"否",null,"その他",null,"伝えるのみ"]
["ADL（日常生活活動",null,null,"・3時間ごとに体位変換必要\n・左の仙骨部横辺りに褥瘡ができやすい"]
["身体の拘縮",null,null,"・不随意運動あり（特に腹部）"]
["禁忌な体位"]
["特記事項",null,null,"・カフエアーがぬけやすい。1～3時間おきにカフのエアー注入が必要。（リーク音かアラーム音が鳴る）\n・気管孔周囲が過敏なため、少しの刺激でむせやすく、胃からの逆流が起こりやすい。\n　呼吸器無しでの移動時等もむせるためバギング不要（サーモベントＴ：人口鼻使用）"]
["バイタル",null,null,"血圧　mmHg",null,null,null,null,null,"９８／５８㎜Ｈｇ",null,"サチュレーション　％",null,null,null,"９５～９９％"]
["(家族等)",null,null,"体温",null,"夏　℃",null,null,null,36.799999999999997,null,"冬　℃",null,36.799999999999997,null,"体温調節　できる/難しい",null,null,null,null,null,"難しい"]
["【８】　家族構成（主な介護者の氏名に〇印）　（必須）"]
["優先順位","氏名",null,null,null,"続柄",null,"同居・別居",null,"携帯電話",null,"メールアドレス",null,"勤務先・学校名",null,null,null,"自宅にいない時間帯",null,null,"備考"]
[2,"岡山　一郎",null,null,null,"父",null,"同居",null,"０８６－２６４－××××"]
[1,"岡山　桃子",null,null,null,"母",null,"同居",null,"０９０－２０〇〇－〇〇〇〇",null,"＊＊＊＊＊＊@i.softbank.jp"]
[]
[]
[]
["【９】　緊急連絡先一覧　＊避難支援者を含む　（必須）"]
["優先順位","区分",null,"機関名",null,null,null,null,null,"担当者氏名",null,"電話",null,null,null,"e-mail"]
[4,"かかりつけ医①",null,"K病院",null,null,null,null,null,"小児外科　猿Dr",null,"０８６－４２２－○○○○"]
[null,"かかりつけ医②",null,"K病院",null,null,null,null,null,"小児科（心臓）犬Dr",null,"０８６－４２２－○○○○"]
[null,"専門医",null,"I大学附属病院",null,null,null,null,null,"神経内科　雉Dr",null,"０８６－４６２－○○○○"]
[null,"利用したことのあるレスパイト先",null,"C施設",null,null,null,null,null,null,null,"０８６－４６３－○○○○"]
[null,"利用したことのあるレスパイト先"]
[null,"薬局",null,"院内処方"]
[1,"訪問看護",null,"訪問看護ステーションE",null,null,null,null,null,"きびNs\n（5人でローテーション）",null,"０８６－２３９－○○○○",null,null,null,"＊＊＊@oka.com"]
[null,"訪問看護"]
[2,"医療機器業者",null,"鬼が島",null,null,null,null,null,"赤鬼さん",null,"０８６－２４１－○○○○"]
[null,"医療機器業者"]
[3,"障害者計画相談支援事業所",null,"玉手箱",null,null,null,null,null,"青鬼さん",null,"０８６－２４２－○○○○"]
[null,"介護保険ケアマネジャー"]
[null,"居宅介護"]
[null,"居宅介護"]
[null,"知人・友人",null,null,null,null,null,null,null,"みころさん",null,"０９０－３３７１－○○○○",null,null,null,"*****@docomo.ne.jp"]
[null,"知人・友人"]
[null,"地域の連絡先",null,"民生委員",null,null,null,null,null,"はころさん",null,"０８６－２６２－○○○○\n０９０－＊＊＊＊－○○○○",null,null,null,"****@docomo.ne.jp"]
[null,"地域の連絡先"]
[null,"行政"]
["その他",null,null,"災害伝言ダイヤル",null,null,null,null,null,null,null,171]
[null,null,null,"中国電力コールセンター",null,null,null,null,null,null,null,"お客様番号"]
[null,null,null,"営業所名",null,null,null,null,null,"岡山ネットワーク\nセンター",null,"電話番号　0120‐",null,null,null,"0120-４１１－３５３"]
[null,null,null,"岡山市水道局　電話受付センター",null,null,null,null,null,null,null,"086-234-5959"]
[]
[]
["【１０】　備蓄チェックリスト（医療機器）　（必修）"]
["人工呼吸器関連\n",null,null,"必要物品","準備済","療養必需品の種類",null,null,null,null,null,null,null,null,"自宅待機\n備蓄量",null,null,"持ち出し分",null,null,"保管場所"]
[null,null,null,"■","■","内部バッテリー","内部バッテリー","内部バッテリー","内部バッテリー","内部バッテリー","内部バッテリー","内部バッテリー","内部バッテリー","内部バッテリー",null,null,null,null,null,null,"ベッド"]
[null,null,null,null,null,"内部バッテリー作動時間",null,null,null,null,null,8,null,"時間"]
[null,null,null,null,null,"消費電力　　　　 　　　",null,null,null,null,null,90,null,"W"]
[null,null,null,"■","■","呼吸器回路（予備）","呼吸器回路（予備）","呼吸器回路（予備）","呼吸器回路（予備）","呼吸器回路（予備）","呼吸器回路（予備）","呼吸器回路（予備）","呼吸器回路（予備）","呼吸器回路（予備）",null,null,null,null,null,null,"和室"]
[null,null,null,"■","■","気管カニューレ（予備）","気管カニューレ（予備）","気管カニューレ（予備）","気管カニューレ（予備）","気管カニューレ（予備）","気管カニューレ（予備）","気管カニューレ（予備）","気管カニューレ（予備）","気管カニューレ（予備）",null,null,null,null,null,null,"バギー"]
[null,null,null,"■","■","気管カニューレ用Ｙ字切込み入りガーゼ","気管カニューレ（予備）","気管カニューレ（予備）","気管カニューレ（予備）","気管カニューレ（予備）","気管カニューレ（予備）","気管カニューレ（予備）","気管カニューレ（予備）","気管カニューレ（予備）",null,null,null,null,null,null,"バギー"]
[null,null,null,"■","■","バンド","気管カニューレ（予備）","気管カニューレ（予備）","気管カニューレ（予備）","気管カニューレ（予備）","気管カニューレ（予備）","気管カニューレ（予備）","気管カニューレ（予備）","気管カニューレ（予備）",null,null,null,null,null,null,"バギー"]
[null,null,null,"■","■","人工鼻","人工鼻","人工鼻","人工鼻","人工鼻","人工鼻","人工鼻","人工鼻","人工鼻",null,null,null,null,null,null,"バギー"]
[null,null,null,"■","■","パルスオキシメーター　（　SＰO２）","パルスオキシメーター　（　SＰO２）","パルスオキシメーター　（　SＰO２）","パルスオキシメーター　（　SＰO２）","パルスオキシメーター　（　SＰO２）","パルスオキシメーター　（　SＰO２）","パルスオキシメーター　（　SＰO２）","パルスオキシメーター　（　SＰO２）","パルスオキシメーター　（　SＰO２）",null,null,null,null,null,null,"バギー"]
[null,null,null,"■","■","バッグバルブマスク（アンビューバック）","バッグバルブマスク（アンビューバック）","バッグバルブマスク（アンビューバック）","バッグバルブマスク（アンビューバック）","バッグバルブマスク（アンビューバック）","バッグバルブマスク（アンビューバック）","バッグバルブマスク（アンビューバック）","バッグバルブマスク（アンビューバック）","バッグバルブマスク（アンビューバック）",null,null,null,null,null,null,"バギー"]
[null,null,"非常用電源","■","■","外部バッテリー","外部バッテリー","外部バッテリー","外部バッテリー","外部バッテリー","外部バッテリー","外部バッテリー","外部バッテリー","外部バッテリー",null,null,null,null,null,null,"ベッド"]
[null,null,null,null,null,"使用可能時間",null,null,null,null,null,7,null,"時間"]
[null,null,null,null,null,"充電時間",null,null,null,null,null,360,null,"分"]
[null,null,null,"■","■","カーインバーター等","カーインバーター等","カーインバーター等","カーインバーター等","カーインバーター等","カーインバーター等","カーインバーター等","カーインバーター等","カーインバーター等",null,null,null,null,null,null,"車"]
[null,null,null,"■","■","延長コード（防水タイプ）（　）ｍ",null,null,null,null,null,2,null,"ｍ",null,null,null,null,null,null,"ベッド"]
[null,null,null,null,null,"（車から充電場所まで　　ｍ）",null,null,null,null,null,null,null,"ｍ"]
[null,null,null,null,null,"発電機　　　　　　　　　　",null,null,null,null,"燃料（種類）"]
[null,null,null,null,null,"燃料（量）"]
[null,null,null,null,null,"蓄電池（メーカー名）"]
["たん吸引器関連","たん吸引器関連",null,"■","■","内部バッテリー","内部バッテリー","内部バッテリー","内部バッテリー","内部バッテリー","内部バッテリー","内部バッテリー","内部バッテリー","内部バッテリー",null,null,null,null,null,null,"ベッドとバギー"]
[null,null,null,null,null,"内部バッテリー作動時間",null,null,null,null,null,0.6,null,"時間"]
[null,null,null,"■","■","携帯用（足踏み式　・　ピストン式吸引器）","携帯用（足踏み式　・　ピストン式吸引器）","携帯用（足踏み式　・　ピストン式吸引器）","携帯用（足踏み式　・　ピストン式吸引器）","携帯用（足踏み式　・　ピストン式吸引器）","携帯用（足踏み式　・　ピストン式吸引器）","携帯用（足踏み式　・　ピストン式吸引器）","携帯用（足踏み式　・　ピストン式吸引器）","携帯用（足踏み式　・　ピストン式吸引器）",null,null,null,null,null,null,"和室"]
[null,null,null,"■","■","吸引カテーテル（本数）とアルコール綿","吸引カテーテル（本数）とアルコール綿","吸引カテーテル（本数）とアルコール綿","吸引カテーテル（本数）とアルコール綿","吸引カテーテル（本数）とアルコール綿","吸引カテーテル（本数）とアルコール綿","吸引カテーテル（本数）とアルコール綿","吸引カテーテル（本数）とアルコール綿","吸引カテーテル（本数）とアルコール綿",null,null,null,null,null,null,"ベッドと和室"]
[null,null,null,"■","■","使い捨てグローブ","使い捨てグローブ","使い捨てグローブ","使い捨てグローブ","使い捨てグローブ","使い捨てグローブ","使い捨てグローブ","使い捨てグローブ","使い捨てグローブ",null,null,null,null,null,null,"和室"]
[null,null,"非常用電源",null,null,"外部バッテリー","外部バッテリー","外部バッテリー","外部バッテリー","外部バッテリー","外部バッテリー","外部バッテリー","外部バッテリー","外部バッテリー"]
[null,null,null,null,null,"使用可能時間",null,null,null,null,null,null,null,"時間"]
[null,null,null,null,null,"充電時間",null,null,null,null,null,null,null,"分"]
[null,null,null,"■","■","シガーソケット対応インバーター","シガーソケット対応インバーター","シガーソケット対応インバーター","シガーソケット対応インバーター","シガーソケット対応インバーター","シガーソケット対応インバーター","シガーソケット対応インバーター","シガーソケット対応インバーター","シガーソケット対応インバーター",null,null,null,null,null,null,"車とベッド"]
[null,null,null,"■","■","延長コード","延長コード","延長コード","延長コード","延長コード","延長コード","延長コード","延長コード","延長コード",null,null,null,null,null,null,"ベッド"]
[]
["在宅酸素関連",null,null,null,null,"内部バッテリー","内部バッテリー","内部バッテリー","内部バッテリー","内部バッテリー","内部バッテリー","内部バッテリー","内部バッテリー","内部バッテリー"]
[null,null,null,"■","■","酸素ボンベ（本数）","酸素ボンベ（本数）","酸素ボンベ（本数）","酸素ボンベ（本数）","酸素ボンベ（本数）","酸素ボンベ（本数）","酸素ボンベ（本数）","酸素ボンベ（本数）","酸素ボンベ（本数）",null,null,null,null,null,null,"バギー"]
[null,null,null,null,null,"酸素ボンベ用カート","酸素ボンベ用カート","酸素ボンベ用カート","酸素ボンベ用カート","酸素ボンベ用カート","酸素ボンベ用カート","酸素ボンベ用カート","酸素ボンベ用カート","酸素ボンベ用カート"]
[null,null,null,"■","■","酸素用チューブ（カテーテル）","酸素用チューブ（カテーテル）","酸素用チューブ（カテーテル）","酸素用チューブ（カテーテル）","酸素用チューブ（カテーテル）","酸素用チューブ（カテーテル）","酸素用チューブ（カテーテル）","酸素用チューブ（カテーテル）","酸素用チューブ（カテーテル）",null,null,null,null,null,null,"ベッド"]
["その他"]
[]
["【１１】　備蓄チェックリスト（療養必需品）　（必須）"]
["食事関連\n",null,null,"必要物品","準備済","医療機器",null,null,null,null,null,null,null,null,"自宅待機\n備蓄量",null,null,"持ち出し分",null,null,"保管場所"]
[null,null,null,"■","■","経管栄養剤",null,null,null,null,"　　種類：",null,null,null,null,null,null,"10本（3日分）",null,null,"和室"]
[null,null,null,null,null,"　　　　　　　　　　　　　　　１日量："]
[null,null,null,null,null,"イルリガートル","イルリガートル","イルリガートル","イルリガートル","イルリガートル","イルリガートル","イルリガートル","イルリガートル","イルリガートル"]
[null,null,null,null,null,"栄養チューブ","栄養チューブ","栄養チューブ","栄養チューブ","栄養チューブ","栄養チューブ","栄養チューブ","栄養チューブ","栄養チューブ"]
[null,null,null,"■","■","接続チューブ","接続チューブ","接続チューブ","接続チューブ","接続チューブ","接続チューブ","接続チューブ","接続チューブ","接続チューブ",null,null,null,"３本",null,null,"和室"]
[null,null,null,null,null,"注入器","注入器","注入器","注入器","注入器","注入器","注入器","注入器","注入器"]
[]
["内服関連",null,null,"■","■","お薬手帳","お薬手帳","お薬手帳","お薬手帳","お薬手帳","お薬手帳","お薬手帳","お薬手帳","お薬手帳",null,null,null,null,null,null,"母親携帯"]
[null,null,null,"■","■","常用薬（予備）","常用薬（予備）","常用薬（予備）","常用薬（予備）","常用薬（予備）","常用薬（予備）","常用薬（予備）","常用薬（予備）","常用薬（予備）",null,null,null,"３日分",null,null,"バギー"]
["衛生材料関連","衛生材料関連","衛生材料関連","■","■","ガーゼ類","ガーゼ類","ガーゼ類","ガーゼ類","ガーゼ類","ガーゼ類","ガーゼ類","ガーゼ類","ガーゼ類",null,null,null,"１０枚分",null,null,"バギー"]
[null,null,null,"■","■","アルコール綿","アルコール綿","アルコール綿","アルコール綿","アルコール綿","アルコール綿","アルコール綿","アルコール綿","アルコール綿",null,null,null,"２パック",null,null,"バギーと和室"]
[null,null,null,"■","■","注射器","注射器","注射器","注射器","注射器","注射器","注射器","注射器","注射器",null,null,null,"１個",null,null,"バギー"]
[null,null,null,null,null,"精製水","精製水","精製水","精製水","精製水","精製水","精製水","精製水","精製水"]
[]
["排泄関連","衛生材料関連","衛生材料関連","■","■","オムツ類","オムツ類","オムツ類","オムツ類","オムツ類","オムツ類","オムツ類","オムツ類","オムツ類",null,null,null,"各１パック",null,null,"和室"]
[null,null,null,null,null,"尿器類","尿器類","尿器類","尿器類","尿器類","尿器類","尿器類","尿器類","尿器類"]
[null,null,null,null,null,"カテーテル・バッグ等","カテーテル・バッグ等","カテーテル・バッグ等","カテーテル・バッグ等","カテーテル・バッグ等","カテーテル・バッグ等","カテーテル・バッグ等","カテーテル・バッグ等","カテーテル・バッグ等"]
[null,null,null,"■","■","おしりふき","おしりふき","おしりふき","おしりふき","おしりふき","おしりふき","おしりふき","おしりふき","おしりふき",null,null,null,"２パック",null,null,"和室とバギー"]
[null,null,null,null,null,"ストマ関連用品","ストマ関連用品","ストマ関連用品","ストマ関連用品","ストマ関連用品","ストマ関連用品","ストマ関連用品","ストマ関連用品","ストマ関連用品"]
["口腔関連","口腔\n衛生","口腔\n衛生","■","■","歯ブラシ","歯ブラシ","歯ブラシ","歯ブラシ","歯ブラシ","歯ブラシ","歯ブラシ","歯ブラシ","歯ブラシ",null,null,null,"１本",null,null,"バギー"]
[null,null,null,"■","■","口腔ケアスポンジ","口腔ケアスポンジ","口腔ケアスポンジ","口腔ケアスポンジ","口腔ケアスポンジ","口腔ケアスポンジ","口腔ケアスポンジ","口腔ケアスポンジ","口腔ケアスポンジ",null,null,null,"３本",null,null,"和室"]
[null,null,null,null,null,"ガーゼ","ガーゼ","ガーゼ","ガーゼ","ガーゼ","ガーゼ","ガーゼ","ガーゼ","ガーゼ"]
[null,null,null,"■","■","紙コップ","紙コップ","紙コップ","紙コップ","紙コップ","紙コップ","紙コップ","紙コップ","紙コップ",null,null,null,"１２個",null,null,"和室"]
["その他",null,null,"■","■","水","水","水","水","水","水","水","水","水",null,null,null,"3本",null,null,"和室"]
[null,null,null,null,null,"コミュニケーション用具","コミュニケーション用具","コミュニケーション用具","コミュニケーション用具","コミュニケーション用具","コミュニケーション用具","コミュニケーション用具","コミュニケーション用具","コミュニケーション用具"]
[null,null,null,"■","■","乾電池","乾電池","乾電池","乾電池","乾電池","乾電池","乾電池","乾電池","乾電池",null,null,null,"単４　2本",null,null,"バギー"]
[null,null,null,null,null,"携帯ラジオ","携帯ラジオ","携帯ラジオ","携帯ラジオ","携帯ラジオ","携帯ラジオ","携帯ラジオ","携帯ラジオ","携帯ラジオ"]
[null,null,null,"■","■","懐中電灯　（ベッド側にあるか）","懐中電灯　（ベッド側にあるか）","懐中電灯　（ベッド側にあるか）","懐中電灯　（ベッド側にあるか）","懐中電灯　（ベッド側にあるか）","懐中電灯　（ベッド側にあるか）","懐中電灯　（ベッド側にあるか）","懐中電灯　（ベッド側にあるか）","懐中電灯　（ベッド側にあるか）",null,null,null,null,null,null,"ベッド"]
[null,null,null,"■","■","筆記用具","筆記用具","筆記用具","筆記用具","筆記用具","筆記用具","筆記用具","筆記用具","筆記用具",null,null,null,null,null,null,"母バック、ベッド"]
[null,null,null,"■","■","保険証・医療受給者証","保険証・医療受給者証","保険証・医療受給者証","保険証・医療受給者証","保険証・医療受給者証","保険証・医療受給者証","保険証・医療受給者証","保険証・医療受給者証","保険証・医療受給者証",null,null,null,null,null,null,"母バック"]
[null,null,null,"■","■","ティッシュ　・　ウエットティッシュ","ティッシュ　・　ウエットティッシュ","ティッシュ　・　ウエットティッシュ","ティッシュ　・　ウエットティッシュ","ティッシュ　・　ウエットティッシュ","ティッシュ　・　ウエットティッシュ","ティッシュ　・　ウエットティッシュ","ティッシュ　・　ウエットティッシュ","ティッシュ　・　ウエットティッシュ",null,null,null,null,null,null,"和室"]
[null,null,null,"■","■","防寒具等","防寒具等","防寒具等","防寒具等","防寒具等","防寒具等","防寒具等","防寒具等","防寒具等",null,null,null,"各１まい",null,null,"バギー"]
[null,null,null,"■","■","クッション類","クッション類","クッション類","クッション類","クッション類","クッション類","クッション類","クッション類","クッション類",null,null,null,null,null,null,"バギーのもの"]
[null,null,null,"■","■","使い捨て手袋","使い捨て手袋","使い捨て手袋","使い捨て手袋","使い捨て手袋","使い捨て手袋","使い捨て手袋","使い捨て手袋","使い捨て手袋",null,null,null,null,null,null,"和室"]
[null,null,null,"■","■","ゴミ袋","ゴミ袋","ゴミ袋","ゴミ袋","ゴミ袋","ゴミ袋","ゴミ袋","ゴミ袋","ゴミ袋",null,null,null,null,null,null,"和室"]
[null,null,null,"■","■","私の災害時個別計画（パーソナルプラン）","私の災害時個別計画（パーソナルプラン）","私の災害時個別計画（パーソナルプラン）","私の災害時個別計画（パーソナルプラン）","私の災害時個別計画（パーソナルプラン）","私の災害時個別計画（パーソナルプラン）","私の災害時個別計画（パーソナルプラン）","私の災害時個別計画（パーソナルプラン）","私の災害時個別計画（パーソナルプラン）",null,null,null,null,null,null,"ベッド"]
[null,null,null,"■","■","チューブ類固定用テープ"]
[null,null,null,"■","■","はさみ"]
["直接写真等を貼り付ける項目があります。"]
["【１２】（任意）　　☆  自宅見取り図　　※避難時の動線、充電場所も記入しましょう。"]
["　　　　　　　　　　☆   人工呼吸器の設定パネルの写真を貼りましょう"]
["　　　　　　　　　　☆　お薬手帳のコピーを貼りましょう"]
["【１３】（任意）　　普段の私（　　　　さん）の様子　　　P１3：直接写真を貼り付ける項目があります。"]
["　　　　　　　　　　週間予定（サービス等利用計画などの写し等）"]
["　　　　　　　　　　１日のスケジュール（栄養・内服の時間等）　"]
["時間",null,null,"スケジュール"]
["00:00:00"]
[]
[]
[]
[]
[]
["06:00:00"]
[]
[null,null,null,"起床、口腔ケア、洗面、服薬"]
[null,null,null,"ミキサー食３００～３５０ml"]
[null,null,null,"月・木・土　ＡＭ入浴"]
[null,null,null,"３日に１回　浣腸"]
["12:00:00"]
[null,null,null,"ミキサー食３００～３５０ml"]
[null,null,null,"YouTube、テレビを見たり、音楽を聴いて過ごす"]
[null,null,null,"YouTube、テレビを見たり、音楽を聴いて過ごす"]
[null,null,null,"YouTube、テレビを見たり、音楽を聴いて過ごす"]
[null,null,null,"YouTube、テレビを見たり、音楽を聴いて過ごす"]
["18:00:00",null,null,"YouTube、テレビを見たり、音楽を聴いて過ごす"]
[]
[null,null,null,"ミキサー食３００～３５０ml"]
[]
[null,null,null,"口腔ケア・服薬"]
[null,null,null,"就寝"]
[1]
["【１４】　今後必要な備えについて　（任意）"]
["項目",null,null,"課題",null,null,null,null,null,"行動計画（誰が、いつまで）",null,null,null,null,null,"結果"]
["（例）\n指定避難場所がわからない",null,null,"自宅からの経路が確認できていない",null,null,null,null,null,"経路の確認\n（本人、家族、訪問看護で、〇年〇月まで）",null,null,null,null,null,"○年〇月一緒に確認"]
["安否確認、避難が必要になったり、物品の確保が必要な時の連絡体制",null,null,"複数の連絡手段の\n確保が必要",null,null,null,null,null,"・web171の登録\n・家族、医療機器メーカー、訪問看護、計画相談事業所、保健師で連絡体制の確認",null,null,null,null,null,"R2.9.1 web171登録（訪問看護ステーションY、民生委員　はころさん、南保健センター）"]
["避難時の支援者の\n確保",null,null,"避難が必要になった時に家族だけでは移動が困難な時の支援者の確保",null,null,null,null,null,"・マンションの母親の知人にお願いしておく\n・いざという時の地域の支援者の確保の検討"]
["必要物品の準備",null,null,"3日分は必要物品の\n確保が必要",null,null,null,null,null,"・期日を決めて、必要物品の確認と保管場所の共有（家族、訪問看護、計画相談事業所、保健師など）"]
["電源の確保",null,null,"停電が長引いたときの\n電源の確保が必要",null,null,null,null,null,"・今後も電源確保に向けて検討"]
["身近な指定避難所の方が災害被害想定が大きい。\nどこに避難すればよいか分からない",null,null,"安全な避難場所の確保",null,null,null,null,null,"・安全で、電源確保可能な福祉避難所やショートステイの確保に向けて情報収集、施設等と相談していく\n・ぼうさいやどかりの登録",null,null,null,null,null,"R2.8月　ぼうさいやどかり登録\n（I大学附属病院　神経内科）"]
[]
["【１５】　個別計画（パーソナルプラン）作成の経過　（任意）"]
["年月日",null,null,"事項"]
["2019-09-03",null,null,"災害時個別支援計画作成にあたっての情報共有（１回目）"]
["2019-10-17",null,null,"災害時個別支援計画作成にあたっての情報共有（２回目）"]
["2019-12-24",null,null,"災害時個別支援計画作成にあたっての情報共有（３回目）"]
["2020-02-26",null,null,"災害時個別支援計画作成にあたっての情報共有（４回目）"]
["2020-06-25",null,null,"災害時個別支援計画作成にあたっての情報共有（５回目）"]
[]
["　同意確認"]
["①避難行動要支援者名簿への登録・変更を申請し、平常時から避難支援等関係者（岡山市危機管理室・岡山市保健所・緊急連絡先一覧の関係機関・町内会や自主防災組織等）に名簿情報を提供することに本人の同意を得ていますか。（対象年度に既に同意を得ている方は不要です。）"]
[]
[]
["②岡山市個別避難計画作成業務委託に関する同意書が本人から得られていますか。"]
[]
[]
["※避難支援者はあくまでもボランティア精神に基づき支援するものであり、法的な責任や義務を負うものではありません\n※私の個別避難計画（パーソナルプラン）を、避難支援等関係者へ配布することはありません。必要があれば、直接お渡しください。"]

{"sheet":"パーソナルプラン表紙（１）","index":1,"n_rows":35,"n_cols":25,"rows_kept":35,"cut":false,"hidden":false,"merged":[[19,8,19,24],[1,43,2,54],[4,38,5,43],[4,44,5,54],[7,1,15,53],[16,1,18,7],[16,8,18,22]]}
[]
[]
[]
[]
[]
[]
[]
[]
[]
[]
[]
[]
[]
[]
[]
[]
[null,"(氏名:",null,null,null,null,null,null,{"$f":"入力シート!D6","v":"岡山　桃太郎"}]
[null,null,null,null,null,null,null,null,null,null,null,null,null,null,null,null,null,null,null,null,null,null,null,null,")"]
[]
[null,null,"作成日：",null,null,null,null,null,{"$f":"入力シート!S1","v":"令和2　年　8　月　27　日"}]
[null,"次回見直し時期：",null,null,null,null,null,null,null,null,null,null,{"$f":"入力シート!S2","v":"令和3 　年　2　月　　日"}]
[]
[]
[]
[null,null,"１．     自宅付近のハザード情報（自然災害の危険予測）"]
[null,null,"２．      いざという時の動き（連絡方法・避難先・避難の手順）"]
[null,null,"３．     緊急連絡用カード　"]
[null,null,"４．　家族構成"]
[null,null,"５．　緊急連絡先一覧"]
[null,null,"６．　備蓄チェックリスト（医療機器・療養必需品）"]
[null,null,"７．　普段の様子"]
[null,null,"８．　週間予定"]
[null,null,"９．　災害から身を守るために"]
[null,null,"１０．　今後必要な備えについて"]
[null,null,"１１．　個別計画（パーソナルプラン）作成の経過"]

{"sheet":"２","index":2,"n_rows":25,"n_cols":7,"rows_kept":25,"cut":false,"hidden":false,"merged":[[16,6,16,50],[17,6,17,50],[8,6,8,50],[9,6,9,50],[10,6,10,50],[11,6,12,50],[13,6,15,50]]}
[]
[]
[null,null,"1．自宅付近のハザード情報（自然災害の危険予測）"]
[null,null,"＝自宅は次の被害が想定されています＝"]
[]
[null,null,null,null,null,"自宅住所：岡山市"]
[]
[]
[null,null,null,null,null,"地　　震",{"$f":"入力シート!D12","v":"南海トラフ地震の最大震度は震度６強の予想。マンション7階のため（耐震化あり）、\n地震時の揺れは強く、液状化現象が起こる可能性あり"}]
[null,null,null,null,null,"津　　波",{"$f":"入力シート!D17","v":"津波発生時、０．５メートル～1メートルの浸水被害の危険あり"}]
[null,null,null,null,null,"土砂災害",{"$f":"入力シート!D22","v":"なし"}]
[null,null,null,null,null,"洪　　水",{"$f":"入力シート!D27","v":"洪水時、０．５メートルの浸水被害の危険あり"}]
[null,null,null,null,null,"（河川等の氾濫）"]
[null,null,null,null,null,"大雨による",{"$f":"入力シート!D32","v":"大雨の時、０．５メートルの浸水被害の危険あり"}]
[null,null,null,null,null,"浸水"]
[null,null,null,null,null,"（下水道で雨水を処理できなくなり浸水すること）"]
[null,null,null,null,null,"台　　風",{"$f":"入力シート!D37","v":"停電の可能性あり"}]
[null,null,null,null,null,"そ  の  他",{"$f":"入力シート!D42","v":0}]
[]
[]
[]
[null,null,null,null,null,"【参考：岡山市ホームページ　岡山市ハザードマップ】"]
[null,null,null,null,null,"https://www.city.okayama.jp/kurashi/category/1-2-1-0-0-0-0-0-0-0.html"]
[null,null,null,null,null,"【岡山市防災メール】"]
[null,null,null,null,null,"bousai.okayama-city@raiden3.ktaiwork.jp"]

{"sheet":"３","index":3,"n_rows":27,"n_cols":43,"rows_kept":27,"cut":false,"hidden":false,"merged":[[27,1,41,50],[3,42,4,50],[5,42,7,50],[8,2,12,2],[8,3,12,19],[8,20,12,32],[8,33,12,41],[8,42,12,50],[18,1,20,1],[18,2,20,2],[18,3,20,19],[18,20,20,32],[18,33,20,41],[8,1,12,1],[13,1,14,1],[15,1,17,1],[13,3,14,19],[13,20,13,32],[14,20,14,32],[13,33,14,41],[15,2,17,2],[15,3,17,19],[15,20,17,32],[15,33,17,41],[13,2,14,2],[3,1,4,2],[5,1,7,1],[3,3,4,19],[5,2,7,2],[5,3,7,19],[3,20,4,32],[5,20,7,32],[3,33,4,41],[5,33,7,41],[18,42,20,50],[13,42,13,50],[14,42,14,50],[15,42,17,50]]}
[]
[null,null,"☆  警戒レベルによる避難情報等の運用について"]
[]
[null,"警戒レベル",null,"行動を市民に促す情報",null,null,null,null,null,null,null,null,null,null,null,null,null,null,null,null,"市民がとるべき行動",null,null,null,null,null,null,null,null,null,null,null,null,"発表・\n発令元",null,null,null,null,null,null,null,null,"警戒レベル\n相当情報"]
[]
[null,5,"災害発生または切迫","緊急安全確保",null,null,null,null,null,null,null,null,null,null,null,null,null,null,null,null,"居住者等は命の危険があることから直ちに安全確保する必要があります。",null,null,null,null,null,null,null,null,null,null,null,null,"岡山市",null,null,null,null,null,null,null,null,"氾濫発生情報\n大雨特別警報"]
[]
[]
[null,4,"災害の\nおそれ高い","避難指示\n\n警戒レベル４までに必ず避難！",null,null,null,null,null,null,null,null,null,null,null,null,null,null,null,null,"居住者等は危険な場所から全員避難する必要があります。\n\n「立退き避難」を基本とし、洪水等及び高潮に対しては、ハザードマップ等により屋内で身の安全を確保できるか等を確認したうえで、居住者等の自らの判断で「屋内安全確保」することも可能です。",null,null,null,null,null,null,null,null,null,null,null,null,"岡山市",null,null,null,null,null,null,null,null,"氾濫危険情報\n土砂災害警戒情報"]
[]
[]
[]
[]
[null,3,"災害の\nおそれあり","高齢者等避難",null,null,null,null,null,null,null,null,null,null,null,null,null,null,null,null,"避難に時間のかかる高齢者等の要配慮者は避難を開始してください。",null,null,null,null,null,null,null,null,null,null,null,null,"岡山市",null,null,null,null,null,null,null,null,"氾濫警戒情報"]
[null,null,null,null,null,null,null,null,null,null,null,null,null,null,null,null,null,null,null,null,"その他の人は、避難の準備をしてください。",null,null,null,null,null,null,null,null,null,null,null,null,null,null,null,null,null,null,null,null,null,"洪水警報"]
[null,2,"気象状況\n悪化","洪水注意報",null,null,null,null,null,null,null,null,null,null,null,null,null,null,null,null,"避難場所や避難経路を再確認するなど、避難に備え自らの避難行動を確認してください。",null,null,null,null,null,null,null,null,null,null,null,null,"気象庁"]
[]
[]
[null,1,"今後気象状況悪化のおそれ","早期注意情報",null,null,null,null,null,null,null,null,null,null,null,null,null,null,null,null,"防災気象情報等の最新情報に注意するなど、災害への心構えを高めてください。",null,null,null,null,null,null,null,null,null,null,null,null,"気象庁"]
[]
[]
[]
[null,"※ 各種の情報は、警戒レベル1～5の順番で発表されるとは限りません。状況が急変することもあります。"]
[null,"※ 上記の定義は令和３年6月現在の定義です。"]
[]
[]
[null,"☆　自宅周辺の地図を貼り付け、避難経路、危険な場所や避難場所等を記載しましょう。"]

{"sheet":"４","index":4,"n_rows":59,"n_cols":17,"rows_kept":59,"cut":false,"hidden":false,"merged":[[1,2,1,51],[52,4,54,15],[55,4,57,15],[58,4,60,15],[52,16,54,49],[55,16,57,49],[58,16,60,49]]}
[]
[null,null,"２．いざという時の動き（連絡方法、避難先、避難の手順）"]
[]
[null,null,"　　自宅で被災した時にどのように対応するかを具体的に記載します。以下の①～⑤を参考に、"]
[null,null,"どのように動いていくかをイメージしてみましょう。"]
[]
[]
[]
[]
[]
[]
[]
[]
[]
[]
[]
[]
[]
[]
[]
[]
[]
[]
[]
[]
[]
[]
[]
[]
[]
[]
[]
[]
[]
[]
[]
[]
[]
[]
[]
[]
[]
[]
[]
[]
[]
[]
[]
[]
[]
[]
[]
[null,null,null,null,"電源が必要な機器\n（非常用電源で確保できる稼働時間）",null,null,null,null,null,null,null,null,null,null,null,{"$f":"入力シート!D50","v":"人工呼吸器、吸引器、加温加湿器　\n非常用電源で約７時間稼働可"}]
[]
[]
[null,null,null,null,"電源確保の方法\n（誰が、何を使って、どうやって）",null,null,null,null,null,null,null,null,null,null,null,{"$f":"入力シート!D55","v":"・基本的に外部バッテリーの稼働時間（約7時間）以内に避難する。垂直避難の場合は、自家用車からインバーターに接続し外部バッテリーを充電しながら人工呼吸器を稼働させる。\n・医療機関、レスパイト先、母方実家など避難先の確認。\n・福祉避難所（電源確保が可能なところ、また、2号線バイパスより北側）の確認。"}]
[]
[]
[null,null,null,null,"災害時、１番に\n連絡する人",null,null,null,null,null,null,null,null,null,null,null,{"$f":"入力シート!D60","v":"医療機器メーカー、訪問看護ステーションY、祖父母"}]

{"sheet":"５","index":5,"n_rows":62,"n_cols":36,"rows_kept":62,"cut":false,"hidden":false,"merged":[[38,11,41,32],[18,5,21,25],[18,34,21,51],[25,11,28,32],[12,11,15,32],[5,5,8,25],[5,34,8,51],[31,5,34,25],[31,34,34,51],[61,1,74,51],[58,5,59,18],[46,5,47,12],[53,5,54,19],[55,5,57,33],[49,6,52,50]]}
[]
[]
[]
[]
[]
[null,null,null,null,null,{"$f":"入力シート!F64","v":"大雨警戒レベル3以上や停電が長引く場合"},null,null,null,null,null,null,null,null,null,null,null,null,null,null,null,null,null,null,null,null,null,null,null,null,null,null,null,null,{"$f":"VLOOKUP(1,入力シート!A67:K72,6,FALSE)","v":"〇ふれあいセンター\n岡山市〇区〇〇"}]
[]
[null,null,null,null,null,null,null,null,null,null,null,null,null,null,null,null,null,null,null,null,null,null,null,null,null,null,"になったら、"]
[]
[]
[null,null,null,null,null,"に避難します。避難をしたら、居場所を"]
[]
[null,null,null,null,null,null,"（名前）",null,null,null,null,{"$f":"入力シート!R64","v":"医療機器メーカー、訪問看護ステーションY、祖父母"}]
[]
[null,null,null,null,null,null,"（連絡先）",null,null,null,null,null,null,null,null,null,null,null,null,null,null,null,null,null,null,null,null,null,null,null,null,null,null,null,null,"に伝えます。"]
[]
[]
[]
[null,null,null,null,null,{"$f":"入力シート!F65","v":"大型台風が予測され警戒レベル３以上の場合"},null,null,null,null,null,null,null,null,null,null,null,null,null,null,null,null,null,null,null,null,null,null,null,null,null,null,null,null,{"$f":"VLOOKUP(1,入力シート!B67:K72,5,FALSE)","v":"C施設\n岡山市北区〇〇"}]
[]
[null,null,null,null,null,null,null,null,null,null,null,null,null,null,null,null,null,null,null,null,null,null,null,null,null,null,"になったら、"]
[]
[]
[null,null,null,null,null,"に避難します。避難をしたら、居場所を"]
[]
[null,null,null,null,null,null,"（名前）",null,null,null,null,{"$f":"入力シート!R65","v":"医療機器メーカー、訪問看護ステーションY、祖父母"}]
[]
[null,null,null,null,null,null,"（連絡先）",null,null,null,null,null,null,null,null,null,null,null,null,null,null,null,null,null,null,null,null,null,null,null,null,null,null,null,null,"に伝えます。"]
[]
[]
[]
[null,null,null,null,null,{"$f":"入力シート!F66","v":"自宅マンションの倒壊などで避難が必要な場合"},null,null,null,null,null,null,null,null,null,null,null,null,null,null,null,null,null,null,null,null,null,null,null,null,null,null,null,null,{"$f":"VLOOKUP(1,入力シート!C67:K72,4,FALSE)","v":"K病院\n岡山市北区〇〇"}]
[]
[null,null,null,null,null,null,null,null,null,null,null,null,null,null,null,null,null,null,null,null,null,null,null,null,null,null,"になったら、"]
[]
[]
[null,null,null,null,null,"に避難します。避難をしたら、居場所を"]
[]
[null,null,null,null,null,null,"（名前）",null,null,null,null,{"$f":"入力シート!R66","v":"医療機器メーカー、訪問看護ステーションY、祖父母"}]
[]
[null,null,null,null,null,null,"（連絡先）",null,null,null,null,null,null,null,null,null,null,null,null,null,null,null,null,null,null,null,null,null,null,null,null,null,null,null,null,"に伝えます。"]
[]
[]
[]
[]
[]
[null,null,null,null,null,"【避難先】"]
[]
[null,null,null,null,null,null,null,null,null,null,null,null,null,null,null,null,null,null,null,null,null,null,null,null,null,null,null,"（住所）"]
[null,null,null,null,null,null,{"$f":"入力シート!F68","v":"K病院\n岡山市北区〇〇"}]
[]
[]
[]
[null,null,null,null,null,"【受付担当者・担当部署】"]
[]
[null,null,null,null,null,{"$f":"入力シート!L68","v":"地域連携室Aさん"}]
[null,null,null,null,null,null,null,null,null,null,null,null,null,null,null,null,null,null,null,null,null,null,null,null,null,null,null,null,null,null,null,null,null,null,null,"に連絡し受け入れを確認する"]
[]
[null,null,null,null,null,"【移動方法】"]
[]
[null,null,null,null,null,"ベッド(自宅)から避難先までの方法、経路、役割分担（誰が何をする）をできるだけ詳しく"]
[null,{"$f":"入力シート!R68","v":"エレベーターが使用できないことが想定されるため、階段までは桃太郎君をバギーに乗せ、階段は以下のとおり4人で介助して１階まで降りる。\n二人でバギーに吸引器、呼吸器等をのせたまま本人の先を降りる。桃太郎くんを一人で横抱きにして、もう一人がサポートしながらバギーに続いて降りる（途中で吸引が必要になる可能性あり）。桃太郎君を抱いて移動する際はバギング不要。カニューレに人工鼻（サーモベントT）を装着。\n車に乗車し移動。道路状況を確認して経路を考える。車が使用できない時の方法の検討が必要。また、浸水被害を考え、車を安全な場所に移動しておくことが必要。"}]

{"sheet":"6","index":6,"n_rows":54,"n_cols":37,"rows_kept":54,"cut":false,"hidden":false,"merged":[[53,3,66,51],[52,3,52,51],[7,7,10,51],[40,7,43,51],[4,6,5,13],[11,6,12,20],[13,6,16,34],[17,6,18,19],[37,6,38,13],[44,6,45,20],[46,6,49,34],[50,6,51,19],[20,3,32,51],[19,3,19,51]]}
[]
[]
[]
[]
[null,null,null,null,null,null,"【避難先】"]
[]
[null,null,null,null,null,null,null,null,null,null,null,null,null,null,null,null,null,null,null,null,null,null,null,null,null,null,null,null,"（住所）"]
[null,null,null,null,null,null,null,{"$f":"入力シート!F70","v":"C施設\n岡山市北区〇〇"}]
[]
[]
[]
[null,null,null,null,null,null,"【受付担当者・担当部署】"]
[]
[null,null,null,null,null,null,{"$f":"入力シート!L70","v":"Bさん"}]
[]
[null,null,null,null,null,null,null,null,null,null,null,null,null,null,null,null,null,null,null,null,null,null,null,null,null,null,null,null,null,null,null,null,null,null,null,null,"に連絡し受け入れを確認する"]
[]
[null,null,null,null,null,null,"【移動方法】"]
[]
[null,null,null,"ベッド(自宅)から避難先までの方法、経路、役割分担（誰が何をする）をできるだけ詳しく"]
[null,null,null,{"$f":"入力シート!R70","v":"ベッドから車までは、避難先①と同じ。\n車に乗車し移動。大雨の場合は、〇川が氾濫している恐れがある。災害状況を確認する。"}]
[]
[]
[]
[]
[]
[]
[]
[]
[]
[]
[]
[]
[]
[]
[]
[]
[null,null,null,null,null,null,"【避難先】"]
[]
[null,null,null,null,null,null,null,null,null,null,null,null,null,null,null,null,null,null,null,null,null,null,null,null,null,null,null,null,"（住所）"]
[null,null,null,null,null,null,null,{"$f":"入力シート!F72","v":"〇ふれあいセンター\n岡山市〇区〇〇"}]
[]
[]
[]
[null,null,null,null,null,null,"【受付担当者・担当部署】"]
[]
[null,null,null,null,null,null,{"$f":"入力シート!L72","v":0}]
[]
[null,null,null,null,null,null,null,null,null,null,null,null,null,null,null,null,null,null,null,null,null,null,null,null,null,null,null,null,null,null,null,null,null,null,null,null,"に連絡し受け入れを確認する"]
[]
[null,null,null,null,null,null,"【移動方法】"]
[]
[null,null,null,"ベッド(自宅)から避難先までの方法、経路、役割分担（誰が何をする）をできるだけ詳しく"]
[null,null,null,{"$f":"入力シート!R72","v":"ベッドから車までは、避難先①と同じ。\n車に乗車し移動。\n車が使用できない場合は、バギーに乗せて移動する。"}]

{"sheet":"7","index":7,"n_rows":50,"n_cols":11,"rows_kept":50,"cut":false,"hidden":false,"merged":[[37,2,37,5],[37,6,37,9],[47,1,49,1],[49,6,49,7],[49,8,49,9],[31,1,37,1],[31,4,31,5],[31,8,32,8],[31,9,32,9],[31,6,31,7],[32,4,32,5],[32,6,32,7],[39,1,40,1],[39,3,39,5],[39,6,39,7],[39,8,39,9],[40,6,40,7],[40,8,40,9],[40,3,40,5],[43,2,43,9],[44,2,44,9],[33,4,33,5],[33,6,33,9],[45,2,45,9],[47,3,47,9],[48,2,48,3],[48,4,48,9],[36,7,36,8],[16,5,16,6],[0,1,1,10],[2,2,2,4],[2,5,2,6],[2,7,2,9],[7,2,7,6],[7,7,7,8],[9,1,10,1],[8,3,8,4],[9,2,10,2],[9,3,9,4],[9,7,9,8],[10,3,10,4],[10,5,10,6],[10,7,10,8],[4,2,4,9],[5,2,5,9],[6,1,7,1],[6,2,6,6],[27,6,27,7],[29,3,29,5],[29,7,29,9],[30,2,30,5],[6,7,6,8],[9,9,10,9],[9,5,9,6],[19,7,19,9],[20,3,20,5],[20,7,20,9],[27,8,27,9],[28,3,28,4],[28,5,28,6],[28,7,28,9],[17,2,17,9],[18,2,18,9],[19,3,19,5],[27,3,27,5],[30,6,30,9],[22,3,22,5],[22,7,22,9],[11,1,16,1],[11,7,11,8],[12,7,12,8],[13,7,13,8],[14,7,14,8],[15,7,15,8],[16,7,16,8],[11,3,11,4],[12,3,12,4],[13,3,13,4],[14,3,14,4],[15,3,15,4],[11,5,11,6],[12,5,12,6],[13,5,13,6],[14,5,14,6],[15,5,15,6],[16,3,16,4],[46,2,46,9],[21,3,21,5],[36,3,36,5],[38,3,38,5],[38,6,38,7],[38,8,38,9],[41,3,41,4],[41,6,41,7],[42,6,42,9],[26,2,26,9],[23,3,23,5],[23,7,23,9],[24,6,24,7],[24,8,24,9],[24,3,24,5],[25,6,25,7],[25,8,25,9],[25,3,25,5],[21,7,21,9],[31,3,32,3],[31,2,32,2],[34,4,34,5],[34,6,34,9],[35,3,35,9]]}
[null,"３．緊急連絡用カード"]
[]
[null,"患者氏名",{"$f":"入力シート!D6","v":"岡山　桃太郎"},null,null,"性別",null,{"$f":"入力シート!O5","v":"男"}]
[null,"生年月日",{"$f":"入力シート!R6","v":1985},"年",{"$f":"入力シート!T6","v":4},"月",{"$f":"入力シート!V6","v":2},"日","血液型",null,{"$f":"入力シート!T76","v":0}]
[null,"住　所",{"$f":"入力シート!O7","v":"〒７００－××××　　　岡山市〇区"}]
[null,"連絡先",{"$f":"入力シート!D79","v":"０８６－２××－××××（自宅）"}]
[null,"病名\n\n合併症",{"$f":"入力シート!D80","v":"ALS"},null,null,null,null,"発病",null,{"$f":"入力シート!V80","v":"H10年８月"}]
[null,null,{"$f":"入力シート!F81","v":"1999年筋生検（先天性筋ジストロフィー症、2014年（側弯症）脊椎固定術、（嚥下困難）胃ろう造設術、2016年（窒息による低酸素脳症）気管切開、腕頭動脈離断術、2017年喉頭気管分離術"},null,null,null,null,"呼吸器装着",null,{"$f":"入力シート!V81","v":"H29年８月"}]
[null,"障害者手帳",{"$f":"入力シート!F82","v":"有"},"身体手帳\n等級",null,{"$f":"入力シート!L82","v":"1級"},"精神手帳等級",{"$f":"入力シート!P82","v":"1級"},"療育手帳",{"$f":"入力シート!V82","v":"A"}]
[null,"介護保険",{"$f":"入力シート!F86","v":0},"要支援度",null,{"$f":"入力シート!L86","v":0},null,"難病指定",null,{"$f":"入力シート!O79","v":"有"}]
[null,null,null,"要介護度",null,{"$f":"入力シート!P86","v":0},null,"受給者証"]
[null,"薬","薬剤名","１日量",null,"服薬回数",null,"服薬時間",null,"備考"]
[null,null,{"$f":"入力シート!D88","v":0},{"$f":"入力シート!L88","v":0},null,{"$f":"入力シート!N88","v":0},null,{"$f":"入力シート!P88","v":0},null,{"$f":"入力シート!U88","v":0}]
[null,null,{"$f":"入力シート!D89","v":0},{"$f":"入力シート!L89","v":0},null,{"$f":"入力シート!N89","v":0},null,{"$f":"入力シート!P89","v":0},null,{"$f":"入力シート!U89","v":0}]
[null,null,{"$f":"入力シート!D90","v":0},{"$f":"入力シート!L90","v":0},null,{"$f":"入力シート!N90","v":0},null,{"$f":"入力シート!P90","v":0},null,{"$f":"入力シート!U90","v":0}]
[null,null,{"$f":"入力シート!D91","v":0},{"$f":"入力シート!L91","v":0},null,{"$f":"入力シート!N91","v":0},null,{"$f":"入力シート!P91","v":0},null,{"$f":"入力シート!U91","v":0}]
[null,null,{"$f":"入力シート!D92","v":0},{"$f":"入力シート!L92","v":0},null,{"$f":"入力シート!N92","v":0},null,{"$f":"入力シート!P92","v":0},null,{"$f":"入力シート!U92","v":0}]
[null,"禁忌薬品",{"$f":"入力シート!D93","v":"なし。抗生物質が入ると下痢になりやすい。鎮静をかけた時などは尿閉がおこる。"}]
[null,"アレルギー",{"$f":"入力シート!D94","v":"なし。"}]
[null,"使用中の","・人工呼吸器　製品名：",{"$f":"入力シート!L95","v":"アストラル\n（鬼ヶ島）　"},null,null,"連絡先：",{"$f":"入力シート!R95","v":0}]
[null,"医療機器","・吸引器　　　製品名：　　　　　　　　　　　　　　　　　　　　　　　　　",{"$f":"入力シート!L96","v":"ミニックDCⅡ\n（工業株式会社）　"},null,null,"連絡先：",{"$f":"入力シート!R96","v":0}]
[null,null,"・ネブライザー製品名：",{"$f":"入力シート!L97","v":0},null,null,"連絡先：",{"$f":"入力シート!R97","v":0}]
[null,null,"・酸素療法　　　　　　　　",{"$f":"入力シート!L97","v":0},null,null,"連絡先：",{"$f":"入力シート!R97","v":0}]
[null,null,"（常時・夜間のみ）　　　　　　　　　　　　　",{"$f":"入力シート!L99","v":"常時"}]
[null,null,"　　安静時：吸入量ℓ／分　　　　　　　　　　　　　　　　　　　　　　　　",{"$f":"入力シート!L100","v":0},null,null,"吸入時間　　　　時間／日",null,{"$f":"入力シート!U100","v":0}]
[null,null,"  　労作時：吸入量ℓ／分　　",{"$f":"入力シート!L101","v":0},null,null,"吸入時間\n時間／日",null,{"$f":"入力シート!U101","v":0}]
[null,null,"・"]
[null,"呼吸","1回換気量　（ml）　　　",{"$f":"入力シート!L102","v":"２５０～３５０ｍｌ"},null,null,"呼吸回数　　　　回",null,{"$f":"入力シート!R102","v":"１４回"}]
[null,"（人工呼吸器使用状況）","離脱の可・不可：",{"$f":"入力シート!L103","v":"可"},null,"離脱可能時間（分）",null,{"$f":"入力シート!R103","v":"６０分"}]
[null,{"$f":"入力シート!A104","v":"夜間のみ"},"気管カニューレ　製品名：",{"$f":"入力シート!L104","v":"A気管切開チューブ\n（オールシリコーン,ストレート型）"},null,null,"サイズ　　　　　mm",{"$f":"入力シート!R104","v":"内径9.0 ㎜ 外径12.3㎜37F"}]
[null,null,"（カフ付き気管カニューレの場合）カフ圧",null,null,null,{"$f":"入力シート!R105","v":"２７～２８"}]
[null,"栄　養","摂取方法：\n胃ろうの有無　",{"$f":"入力シート!J106","v":"有"},"（バルーン・バンパー）",null,{"$f":"入力シート!P106","v":"バルーン"},null,"バルーンの固定水　　㎖",{"$f":"入力シート!V106","v":0}]
[null,null,null,null,"(ボタン・チューブ）　　　　　　",null,{"$f":"入力シート!L106","v":"ボタン"}]
[null,null,"経鼻経管の有無",{"$f":"入力シート!J106","v":"有"},"サイズ・種類",null,{"$f":"入力シート!M107","v":0}]
[null,null,"固定位置の深さ",{"$f":"入力シート!J108","v":0},"その他",null,{"$f":"入力シート!M108","v":0}]
[null,null,"種類：",{"$f":"入力シート!F109","v":"ミキサー食、メイバランス"}]
[null,null,"量：　　　　　　　　　　　　",{"$f":"入力シート!F110","v":"３００～３５０"},null,null,"　ml／回　　　　　　　　　　　　　　　　",{"$f":"入力シート!N110","v":3},null,"回／日"]
[null,null,"方法：　シリンジ・注入ポンプ",null,null,null,{"$f":"入力シート!O111","v":0}]
[null,null,"トイレ","おむつ",null,null,"　浣腸\n（回／　日）",null,"導尿\n（回／日）"]
[null,"排泄",{"$f":"入力シート!F112","v":"全介助"},{"$f":"入力シート!F112","v":"全介助"},null,null,{"$f":"入力シート!V112","v":0},null,{"$f":"入力シート!P112","v":0}]
[null,null,"ストーマの有無",{"$f":"入力シート!J113","v":"無"},null,null,"（交換頻度　　　回／日　）",null,{"$f":"入力シート!P113","v":0}]
[null,"コミュニ","会話　",{"$f":"入力シート!F114","v":"否"},null,"筆談　",{"$f":"入力シート!L114","v":"否"},null,"文字盤　",{"$f":"入力シート!P114","v":"否"}]
[null,"ケーション　　","意思伝達装置　",{"$f":"入力シート!L115","v":"否"},null,"その他",{"$f":"入力シート!P115","v":"伝えるのみ"}]
[null,"ADL（日常生活活動）",{"$f":"入力シート!D116","v":"・3時間ごとに体位変換必要\n・左の仙骨部横辺りに褥瘡ができやすい"}]
[null,"身体の拘縮",{"$f":"入力シート!D117","v":"・不随意運動あり（特に腹部）"}]
[null,"禁忌な体位",{"$f":"入力シート!D118","v":0}]
[null,"特記事項",{"$f":"入力シート!D119","v":"・カフエアーがぬけやすい。1～3時間おきにカフのエアー注入が必要。（リーク音かアラーム音が鳴る）\n・気管孔周囲が過敏なため、少しの刺激でむせやすく、胃からの逆流が起こりやすい。\n　呼吸器無しでの移動時等もむせるためバギング不要（サーモベントＴ：人口鼻使用）"}]
[null,"バイタル","血圧（　／　㎜Ｈｇ）　",{"$f":"入力シート!J120","v":"９８／５８㎜Ｈｇ"}]
[null,null,"酸素飽和度（％）",null,{"$f":"入力シート!P120","v":"９５～９９％"}]
[null,null,"体温　夏（℃）",{"$f":"入力シート!J121","v":36.799999999999997},"冬（℃）　　",{"$f":"入力シート!N121","v":36.799999999999997},"体温調節：できる・難しい",null,{"$f":"入力シート!V121","v":"難しい"}]

{"sheet":"8","index":8,"n_rows":14,"n_cols":9,"rows_kept":14,"cut":false,"hidden":false,"merged":[[2,8,3,8],[1,1,1,7],[2,1,3,1],[2,2,3,2],[2,3,3,3],[2,6,3,6],[6,6,7,6],[8,6,9,6],[4,7,5,7],[4,8,5,8],[6,1,7,1],[6,2,7,2],[6,3,7,3],[6,4,7,4],[6,7,7,7],[6,8,7,8],[4,4,5,4],[4,3,5,3],[4,2,5,2],[4,1,5,1],[4,6,5,6],[8,7,9,7],[8,8,9,8],[10,1,11,1],[10,2,11,2],[10,3,11,3],[10,4,11,4],[10,6,11,6],[10,7,11,7],[10,8,11,8],[8,1,9,1],[8,2,9,2],[8,3,9,3],[8,4,9,4],[12,7,13,7],[12,8,13,8],[12,1,13,1],[12,2,13,2],[12,3,13,3],[12,4,13,4],[12,6,13,6]]}
[]
[null,"４．家族構成（主な介護者の氏名に〇印）"]
[null,"連絡\n順位","氏名","続柄","同居","携帯電話","勤務先・学校名","自宅にいない","特記事項"]
[null,null,null,null,"別居","メールアドレス",null,"時間帯"]
[null,{"$f":"入力シート!A124","v":2},{"$f":"入力シート!B124","v":"岡山　一郎"},{"$f":"入力シート!F124","v":"父"},{"$f":"入力シート!H124","v":"同居"},{"$f":"入力シート!J124","v":"０８６－２６４－××××"},{"$f":"入力シート!N124","v":0},{"$f":"入力シート!R124","v":0},{"$f":"入力シート!U124","v":0}]
[null,null,null,null,null,{"$f":"入力シート!L124","v":0}]
[null,{"$f":"入力シート!A125","v":1},{"$f":"入力シート!B125","v":"岡山　桃子"},{"$f":"入力シート!F125","v":"母"},{"$f":"入力シート!H125","v":"同居"},{"$f":"入力シート!L125","v":"＊＊＊＊＊＊@i.softbank.jp"},{"$f":"入力シート!N125","v":0},{"$f":"入力シート!R125","v":0},{"$f":"入力シート!U125","v":0}]
[null,null,null,null,null,{"$f":"入力シート!L125","v":"＊＊＊＊＊＊@i.softbank.jp"}]
[null,{"$f":"入力シート!A126","v":0},{"$f":"入力シート!B126","v":0},{"$f":"入力シート!F126","v":0},{"$f":"入力シート!H126","v":0},{"$f":"入力シート!J126","v":0},{"$f":"入力シート!N126","v":0},{"$f":"入力シート!R126","v":0},{"$f":"入力シート!U126","v":0}]
[null,null,null,null,null,{"$f":"入力シート!L126","v":0}]
[null,{"$f":"入力シート!A127","v":0},{"$f":"入力シート!B127","v":0},{"$f":"入力シート!F127","v":0},{"$f":"入力シート!H127","v":0},{"$f":"入力シート!J127","v":0},{"$f":"入力シート!N127","v":0},{"$f":"入力シート!R127","v":0},{"$f":"入力シート!U127","v":0}]
[null,null,null,null,null,{"$f":"入力シート!L127","v":0}]
[null,{"$f":"入力シート!A128","v":0},{"$f":"入力シート!B128","v":0},{"$f":"入力シート!F128","v":0},{"$f":"入力シート!H128","v":0},{"$f":"入力シート!J128","v":0},{"$f":"入力シート!N128","v":0},{"$f":"入力シート!R128","v":0},{"$f":"入力シート!U128","v":0}]
[null,null,null,null,null,{"$f":"入力シート!L128","v":0}]

{"sheet":"9","index":9,"n_rows":31,"n_cols":6,"rows_kept":31,"cut":false,"hidden":false,"merged":[[16,0,17,0],[7,0,8,0],[14,0,15,0],[25,1,30,1],[25,2,25,3],[26,2,26,3],[28,2,28,3],[29,2,29,3],[30,2,30,3],[1,1,1,4],[14,3,15,3],[14,4,15,4],[14,5,15,5],[16,2,17,2],[16,3,17,3],[16,4,17,4],[16,5,17,5],[7,1,8,1],[7,2,8,2],[7,3,8,3],[7,4,8,4],[7,5,8,5],[14,2,15,2]]}
[]
[null,"５．緊急連絡先一覧"]
["優先\n順位","区分","機関名","担当者氏名","電話","e-mail"]
[{"$f":"入力シート!A131","v":4},"かかりつけ医①",{"$f":"入力シート!D131","v":"K病院"},{"$f":"入力シート!J131","v":"小児外科　猿Dr"},{"$f":"入力シート!L131","v":"０８６－４２２－○○○○"},{"$f":"入力シート!P131","v":0}]
[{"$f":"入力シート!A132","v":0},"かかりつけ医②",{"$f":"入力シート!D132","v":"K病院"},{"$f":"入力シート!J132","v":"小児科（心臓）犬Dr"},{"$f":"入力シート!L132","v":"０８６－４２２－○○○○"},{"$f":"入力シート!P132","v":0}]
[{"$f":"入力シート!A133","v":0},"専門医",{"$f":"入力シート!D133","v":"I大学附属病院"},{"$f":"入力シート!J133","v":"神経内科　雉Dr"},{"$f":"入力シート!L133","v":"０８６－４６２－○○○○"},{"$f":"入力シート!P133","v":0}]
[{"$f":"入力シート!A134","v":0},"利用したことのあるレスパイト先",{"$f":"入力シート!D134","v":"C施設"},{"$f":"入力シート!J134","v":0},{"$f":"入力シート!L134","v":"０８６－４６３－○○○○"},{"$f":"入力シート!P134","v":0}]
[{"$f":"入力シート!A135","v":0},"利用したことのあるレスパイト先",{"$f":"入力シート!D135","v":0},{"$f":"入力シート!J135","v":0},{"$f":"入力シート!L135","v":0},{"$f":"入力シート!G135","v":0}]
[]
[{"$f":"入力シート!A136","v":0},"薬局",{"$f":"入力シート!D136","v":"院内処方"},{"$f":"入力シート!J136","v":0},{"$f":"入力シート!L136","v":0},{"$f":"入力シート!G136","v":0}]
[{"$f":"入力シート!A137","v":1},"訪問看護",{"$f":"入力シート!D137","v":"訪問看護ステーションE"},{"$f":"入力シート!J137","v":"きびNs\n（5人でローテーション）"},{"$f":"入力シート!L137","v":"０８６－２３９－○○○○"},{"$f":"入力シート!G137","v":0}]
[{"$f":"入力シート!A138","v":0},"訪問看護",{"$f":"入力シート!D138","v":0},{"$f":"入力シート!J138","v":0},{"$f":"入力シート!L138","v":0},{"$f":"入力シート!G138","v":0}]
[{"$f":"入力シート!A139","v":2},"医療機器業者",{"$f":"入力シート!D139","v":"鬼が島"},{"$f":"入力シート!J139","v":"赤鬼さん"},{"$f":"入力シート!L139","v":"０８６－２４１－○○○○"},{"$f":"入力シート!G139","v":0}]
[{"$f":"入力シート!A140","v":0},"医療機器業者",{"$f":"入力シート!D140","v":0},{"$f":"入力シート!J140","v":0},{"$f":"入力シート!L140","v":0},{"$f":"入力シート!G140","v":0}]
[{"$f":"入力シート!A141","v":3},"障害者計画相談",{"$f":"入力シート!D141","v":"玉手箱"},{"$f":"入力シート!J141","v":"青鬼さん"},{"$f":"入力シート!L141","v":"０８６－２４２－○○○○"},{"$f":"入力シート!G141","v":0}]
[null,"支援事業所"]
[{"$f":"入力シート!A142","v":0},"介護保険ケア",{"$f":"入力シート!D142","v":0},{"$f":"入力シート!J142","v":0},{"$f":"入力シート!L142","v":0},{"$f":"入力シート!G142","v":0}]
[null,"マネジャー"]
[{"$f":"入力シート!A143","v":0},"居宅介護",{"$f":"入力シート!D143","v":0},{"$f":"入力シート!J143","v":0},{"$f":"入力シート!L143","v":0},{"$f":"入力シート!P143","v":0}]
[{"$f":"入力シート!A144","v":0},null,{"$f":"入力シート!D144","v":0},{"$f":"入力シート!J144","v":0},{"$f":"入力シート!L144","v":0},{"$f":"入力シート!P144","v":0}]
[{"$f":"入力シート!A145","v":0},"知人・友人",{"$f":"入力シート!D145","v":0},{"$f":"入力シート!J145","v":"みころさん"},{"$f":"入力シート!L145","v":"０９０－３３７１－○○○○"},{"$f":"入力シート!P145","v":"*****@docomo.ne.jp"}]
[{"$f":"入力シート!A146","v":0},null,{"$f":"入力シート!D146","v":0},{"$f":"入力シート!J146","v":0},{"$f":"入力シート!L146","v":0},{"$f":"入力シート!P146","v":0}]
[{"$f":"入力シート!A147","v":0},"地域の連絡先",{"$f":"入力シート!D147","v":"民生委員"},{"$f":"入力シート!J147","v":"はころさん"},{"$f":"入力シート!L147","v":"０８６－２６２－○○○○\n０９０－＊＊＊＊－○○○○"},{"$f":"入力シート!P147","v":"****@docomo.ne.jp"}]
[{"$f":"入力シート!A148","v":0},null,{"$f":"入力シート!D148","v":0},{"$f":"入力シート!J148","v":0},{"$f":"入力シート!L148","v":0},{"$f":"入力シート!P148","v":0}]
[{"$f":"入力シート!A149","v":0},"行政",{"$f":"入力シート!D149","v":0},{"$f":"入力シート!J149","v":0},{"$f":"入力シート!L149","v":0},{"$f":"入力シート!P149","v":0}]
[null,"その他","災害伝言ダイヤル",null,171]
[null,null,"中国電力コールセンター（　　　）営業所",null,{"$f":"入力シート!J152","v":"岡山ネットワーク\nセンター"},"※停電情報は"]
[null,null,"お客様番号",{"$f":"入力シート!P151","v":0},{"$f":"入力シート!P152","v":"0120-４１１－３５３"},"「停電情報アプリ」でも確認可能"]
[null,null,"岡山市水道局　電話受付センター",null,"086-234-5959"]
[null,null,{"$f":"入力シート!D154","v":0},null,{"$f":"入力シート!L154","v":0}]
[null,null,{"$f":"入力シート!D155","v":0},null,{"$f":"入力シート!L155","v":0}]

{"sheet":"10","index":10,"n_rows":43,"n_cols":10,"rows_kept":43,"cut":false,"hidden":false,"merged":[[25,1,35,1],[25,2,29,2],[25,3,26,3],[25,4,26,4],[25,5,25,6],[27,5,27,6],[28,5,28,6],[29,5,29,6],[30,5,30,6],[33,5,33,6],[34,5,34,6],[15,9,17,9],[19,3,20,3],[19,4,20,4],[19,7,20,7],[19,8,20,8],[19,9,20,9],[18,5,18,6],[15,2,23,2],[15,3,17,3],[15,4,17,4],[15,7,17,7],[15,8,17,8],[5,3,7,3],[5,4,7,4],[21,3,22,3],[21,4,22,4],[5,5,5,6],[8,5,8,6],[11,5,11,6],[12,5,12,6],[13,5,13,6],[14,5,14,6],[15,5,15,6],[10,5,10,6],[9,5,9,6],[1,1,1,9],[25,7,26,7],[25,8,26,8],[25,9,26,9],[30,2,35,2],[30,3,32,3],[30,4,32,4],[30,7,32,7],[30,8,32,8],[30,9,32,9],[2,1,3,1],[2,2,3,2],[2,3,3,3],[2,8,3,8],[2,9,3,9],[5,1,23,1],[21,9,22,9],[36,1,36,4],[41,5,41,6],[42,5,42,6],[2,5,3,6],[21,7,22,7],[21,8,22,8],[37,5,37,6],[38,5,38,6],[39,5,39,6],[40,5,40,6],[4,1,4,4],[24,1,24,4],[37,1,40,2],[41,1,42,2],[5,2,14,2]]}
[]
[null,"６．備蓄チェックリスト（医療機器）"]
[null,null,null,"必要物品","準備","医療機器",null,"自宅待機","持ち出し分","保管場所"]
[null,null,null,null,"済",null,null,"備蓄量"]
[null,"人工呼吸器（機種名）：",null,null,null,{"$f":"入力シート!L95","v":"アストラル\n（鬼ヶ島）　"}]
[null,"人工呼吸器関連",null,{"$f":"入力シート!D158","v":"■"},{"$f":"入力シート!E158","v":"■"},"内部バッテリー",null,{"$f":"入力シート!O159","v":0},{"$f":"入力シート!R159","v":0},{"$f":"入力シート!U159","v":0}]
[null,null,null,null,null,"内部バッテリー作動時間：（時間）",{"$f":"入力シート!L159","v":8}]
[null,null,null,null,null,"消費電力　　　　 　　　：（W）",{"$f":"入力シート!L160","v":90}]
[null,null,null,{"$f":"入力シート!D161","v":"■"},{"$f":"入力シート!E161","v":"■"},"呼吸器回路（予備）",null,{"$f":"入力シート!O161","v":0},{"$f":"入力シート!R161","v":0},{"$f":"入力シート!U161","v":"和室"}]
[null,null,null,{"$f":"入力シート!D161","v":"■"},{"$f":"入力シート!E162","v":"■"},"気管カニューレ（予備）",null,{"$f":"入力シート!O160","v":0},{"$f":"入力シート!R160","v":0},{"$f":"入力シート!U160","v":0}]
[null,null,null,{"$f":"入力シート!D164","v":"■"},{"$f":"入力シート!E163","v":"■"},{"$f":"入力シート!F163","v":"気管カニューレ用Ｙ字切込み入りガーゼ"},null,{"$f":"入力シート!O161","v":0},{"$f":"入力シート!R161","v":0},{"$f":"入力シート!U161","v":"和室"}]
[null,null,null,{"$f":"入力シート!D164","v":"■"},{"$f":"入力シート!E164","v":"■"},{"$f":"入力シート!F164","v":"バンド"},null,{"$f":"入力シート!O164","v":0},{"$f":"入力シート!R164","v":0},{"$f":"入力シート!U164","v":"バギー"}]
[null,null,null,{"$f":"入力シート!D165","v":"■"},{"$f":"入力シート!E165","v":"■"},"人工鼻",null,{"$f":"入力シート!O165","v":0},{"$f":"入力シート!R165","v":0},{"$f":"入力シート!U165","v":"バギー"}]
[null,null,null,{"$f":"入力シート!D166","v":"■"},{"$f":"入力シート!E166","v":"■"},"パルスオキシメーター　（　SＰO２）",null,{"$f":"入力シート!O166","v":0},{"$f":"入力シート!R166","v":0},{"$f":"入力シート!U166","v":"バギー"}]
[null,null,null,{"$f":"入力シート!D167","v":"■"},{"$f":"入力シート!E167","v":"■"},"バッグバルブマスク（アンビューバック）",null,{"$f":"入力シート!O167","v":0},{"$f":"入力シート!R167","v":0},{"$f":"入力シート!U167","v":"バギー"}]
[null,null,"非常用電源",{"$f":"入力シート!D168","v":"■"},{"$f":"入力シート!E168","v":"■"},"外部バッテリー",null,{"$f":"入力シート!O168","v":0},{"$f":"入力シート!R168","v":0},{"$f":"入力シート!U168","v":"ベッド"}]
[null,null,null,null,null,"使用可能時間：（時間　）",{"$f":"入力シート!L169","v":7}]
[null,null,null,null,null,"充電時間：（分）",{"$f":"入力シート!L170","v":360}]
[null,null,null,{"$f":"入力シート!D171","v":"■"},{"$f":"入力シート!E171","v":"■"},"カーインバーター等",null,{"$f":"入力シート!O171","v":0},{"$f":"入力シート!R171","v":0},{"$f":"入力シート!U171","v":"車"}]
[null,null,null,{"$f":"入力シート!D172","v":"■"},{"$f":"入力シート!E172","v":"■"},"延長コード（防水タイプ）（ｍ）",{"$f":"入力シート!L172","v":2},{"$f":"入力シート!O172","v":0},{"$f":"入力シート!R172","v":0},{"$f":"入力シート!U172","v":"ベッド"}]
[null,null,null,null,null,"（車から充電場所まで　　ｍ）",{"$f":"入力シート!L173","v":0}]
[null,null,null,{"$f":"入力シート!D174","v":0},{"$f":"入力シート!E174","v":0},"発電機　燃料　種類：　　　　　　　　　　　　　",{"$f":"入力シート!L174","v":0},{"$f":"入力シート!O175","v":0},{"$f":"入力シート!R175","v":0},{"$f":"入力シート!U175","v":0}]
[null,null,null,null,null,"量：",{"$f":"入力シート!L175","v":0}]
[null,null,null,{"$f":"入力シート!D176","v":0},{"$f":"入力シート!E176","v":0},"蓄電池（メーカー：）",{"$f":"入力シート!L176","v":0},{"$f":"入力シート!O176","v":0},{"$f":"入力シート!R176","v":0},{"$f":"入力シート!U176","v":0}]
[null,"たん吸引器（機種名）：",null,null,null,{"$f":"入力シート!L96","v":"ミニックDCⅡ\n（工業株式会社）　"}]
[null,"たん吸引器関連",null,{"$f":"入力シート!D177","v":"■"},{"$f":"入力シート!E177","v":"■"},"内部バッテリー",null,{"$f":"入力シート!O177","v":0},{"$f":"入力シート!R177","v":0},{"$f":"入力シート!U177","v":"ベッドとバギー"}]
[null,null,null,null,null,"内部バッテリー作動時間：（時間）",{"$f":"入力シート!L178","v":0.6}]
[null,null,null,{"$f":"入力シート!D179","v":"■"},{"$f":"入力シート!E179","v":"■"},"携帯用（足踏み式　・　ピストン式吸引器）",null,{"$f":"入力シート!O179","v":0},{"$f":"入力シート!R179","v":0},{"$f":"入力シート!U179","v":"和室"}]
[null,null,null,{"$f":"入力シート!D180","v":"■"},{"$f":"入力シート!E180","v":"■"},"吸引カテーテル（本数）とアルコール綿",null,{"$f":"入力シート!O180","v":0},{"$f":"入力シート!R180","v":0},{"$f":"入力シート!U180","v":"ベッドと和室"}]
[null,null,null,{"$f":"入力シート!D181","v":"■"},{"$f":"入力シート!E181","v":"■"},"使い捨てグローブ",null,{"$f":"入力シート!O181","v":0},{"$f":"入力シート!R181","v":0},{"$f":"入力シート!U181","v":"和室"}]
[null,null,"非常用電源",{"$f":"入力シート!D182","v":0},{"$f":"入力シート!E182","v":0},"外部バッテリー",null,{"$f":"入力シート!O182","v":0},{"$f":"入力シート!R182","v":0},{"$f":"入力シート!U182","v":0}]
[null,null,null,null,null,"使用可能時間：（　　　）時間",{"$f":"入力シート!L169","v":7}]
[null,null,null,null,null,"充電時間：（　　　）分",{"$f":"入力シート!L170","v":360}]
[null,null,null,{"$f":"入力シート!D185","v":"■"},{"$f":"入力シート!E185","v":"■"},"シガーソケット対応インバーター",null,{"$f":"入力シート!O185","v":0},{"$f":"入力シート!R185","v":0},{"$f":"入力シート!U185","v":"車とベッド"}]
[null,null,null,{"$f":"入力シート!D186","v":"■"},{"$f":"入力シート!E186","v":"■"},"延長コード",null,{"$f":"入力シート!O186","v":0},{"$f":"入力シート!R186","v":0},{"$f":"入力シート!U186","v":"ベッド"}]
[null,null,null,{"$f":"入力シート!D187","v":0},{"$f":"入力シート!E187","v":0},{"$f":"入力シート!F187","v":0},null,{"$f":"入力シート!O187","v":0},{"$f":"入力シート!R187","v":0},{"$f":"入力シート!U187","v":0}]
[null,"酸素濃縮器（機種名）：",null,null,null,{"$f":"入力シート!L98","v":0}]
[null,"在宅酸素関連",null,{"$f":"入力シート!D188","v":0},{"$f":"入力シート!E188","v":0},"内部バッテリー",null,{"$f":"入力シート!O188","v":0},{"$f":"入力シート!R188","v":0},{"$f":"入力シート!U188","v":0}]
[null,null,null,{"$f":"入力シート!D189","v":"■"},{"$f":"入力シート!E189","v":"■"},"酸素ボンベ（本数）",null,{"$f":"入力シート!O189","v":0},{"$f":"入力シート!R189","v":0},{"$f":"入力シート!U189","v":"バギー"}]
[null,null,null,{"$f":"入力シート!D190","v":0},{"$f":"入力シート!E190","v":0},"酸素ボンベ用カート",null,{"$f":"入力シート!O190","v":0},{"$f":"入力シート!R190","v":0},{"$f":"入力シート!U190","v":0}]
[null,null,null,{"$f":"入力シート!D191","v":"■"},{"$f":"入力シート!E191","v":"■"},"酸素用チューブ（カテーテル）",null,{"$f":"入力シート!O191","v":0},{"$f":"入力シート!R191","v":0},{"$f":"入力シート!U191","v":"ベッド"}]
[null,"その他",null,{"$f":"入力シート!D192","v":0},{"$f":"入力シート!E192","v":0},{"$f":"入力シート!F192","v":0},null,{"$f":"入力シート!O192","v":0},{"$f":"入力シート!R192","v":0},{"$f":"入力シート!U192","v":0}]
[null,null,null,{"$f":"入力シート!D193","v":0},{"$f":"入力シート!E193","v":0},{"$f":"入力シート!F193","v":0},null,{"$f":"入力シート!O193","v":0},{"$f":"入力シート!R193","v":0},{"$f":"入力シート!U193","v":0}]

{"sheet":"11","index":11,"n_rows":42,"n_cols":9,"rows_kept":42,"cut":false,"hidden":false,"merged":[[4,7,5,7],[27,1,41,1],[1,1,1,8],[4,8,5,8],[11,1,12,1],[13,1,17,1],[18,1,22,1],[23,1,26,1],[2,1,3,1],[2,2,3,2],[2,7,3,7],[2,8,3,8],[4,1,10,1],[4,2,5,2],[2,4,3,5],[6,4,6,5],[4,3,5,3],[4,6,5,6],[7,4,7,5],[8,4,8,5],[9,4,9,5],[10,4,10,5],[11,4,11,5],[12,4,12,5],[13,4,13,5],[14,4,14,5],[15,4,15,5],[16,4,16,5],[17,4,17,5],[18,4,18,5],[19,4,19,5],[20,4,20,5],[21,4,21,5],[22,4,22,5],[23,4,23,5],[24,4,24,5],[25,4,25,5],[26,4,26,5],[27,4,27,5],[28,4,28,5],[29,4,29,5],[30,4,30,5],[31,4,31,5],[32,4,32,5],[33,4,33,5],[34,4,34,5],[40,4,40,5],[41,4,41,5],[35,4,35,5],[36,4,36,5],[37,4,37,5],[38,4,38,5],[39,4,39,5]]}
[]
[null,"６．備蓄チェックリスト（療養必需品）"]
[null,null,"必要物品","準備","療養必需品の種類",null,"自宅待機","持ち出し分","保管場所"]
[null,null,null,"済",null,null,"備蓄量"]
[null,"食事関連",{"$f":"入力シート!D196","v":"■"},{"$f":"入力シート!E196","v":"■"},"経管栄養剤　　種類：　",{"$f":"入力シート!L196","v":0},{"$f":"入力シート!O196","v":0},{"$f":"入力シート!R196","v":"10本（3日分）"},{"$f":"入力シート!U196","v":"和室"}]
[null,null,null,null,"　　　　　　１日量：",{"$f":"入力シート!L197","v":0}]
[null,null,{"$f":"入力シート!D198","v":0},{"$f":"入力シート!E198","v":0},"イルリガートル",null,{"$f":"入力シート!O198","v":0},{"$f":"入力シート!R198","v":0},{"$f":"入力シート!U198","v":0}]
[null,null,{"$f":"入力シート!D199","v":0},{"$f":"入力シート!E199","v":0},"栄養チューブ",null,{"$f":"入力シート!O199","v":0},{"$f":"入力シート!R199","v":0},{"$f":"入力シート!U199","v":0}]
[null,null,{"$f":"入力シート!D200","v":"■"},{"$f":"入力シート!E200","v":"■"},"接続チューブ",null,{"$f":"入力シート!O200","v":0},{"$f":"入力シート!R200","v":"３本"},{"$f":"入力シート!U200","v":"和室"}]
[null,null,{"$f":"入力シート!D201","v":0},{"$f":"入力シート!E201","v":0},"注入器",null,{"$f":"入力シート!O201","v":0},{"$f":"入力シート!R201","v":0},{"$f":"入力シート!U201","v":0}]
[null,null,{"$f":"入力シート!D202","v":0},{"$f":"入力シート!E202","v":0},null,null,{"$f":"入力シート!O202","v":0},{"$f":"入力シート!R202","v":0},{"$f":"入力シート!U202","v":0}]
[null,"内服関連",{"$f":"入力シート!D203","v":"■"},{"$f":"入力シート!E203","v":"■"},"お薬手帳",null,{"$f":"入力シート!O203","v":0},{"$f":"入力シート!R203","v":0},{"$f":"入力シート!U203","v":"母親携帯"}]
[null,null,{"$f":"入力シート!D204","v":"■"},{"$f":"入力シート!E204","v":"■"},"常用薬（予備）",null,{"$f":"入力シート!O204","v":0},{"$f":"入力シート!R204","v":"３日分"},{"$f":"入力シート!U204","v":"バギー"}]
[null,"衛生材料関連",{"$f":"入力シート!D205","v":"■"},{"$f":"入力シート!E205","v":"■"},"ガーゼ類",null,{"$f":"入力シート!O205","v":0},{"$f":"入力シート!R205","v":"１０枚分"},{"$f":"入力シート!U205","v":"バギー"}]
[null,null,{"$f":"入力シート!D206","v":"■"},{"$f":"入力シート!E206","v":"■"},"アルコール綿",null,{"$f":"入力シート!O206","v":0},{"$f":"入力シート!R206","v":"２パック"},{"$f":"入力シート!U206","v":"バギーと和室"}]
[null,null,{"$f":"入力シート!D207","v":"■"},{"$f":"入力シート!E207","v":"■"},"注射器",null,{"$f":"入力シート!O207","v":0},{"$f":"入力シート!R207","v":"１個"},{"$f":"入力シート!U207","v":"バギー"}]
[null,null,{"$f":"入力シート!D208","v":0},{"$f":"入力シート!E208","v":0},"精製水",null,{"$f":"入力シート!O208","v":0},{"$f":"入力シート!R208","v":0},{"$f":"入力シート!U208","v":0}]
[null,null,{"$f":"入力シート!D209","v":0},{"$f":"入力シート!E209","v":0},null,null,{"$f":"入力シート!O209","v":0},{"$f":"入力シート!R209","v":0},{"$f":"入力シート!U209","v":0}]
[null,"排泄関連",{"$f":"入力シート!D210","v":"■"},{"$f":"入力シート!E210","v":"■"},"オムツ類",null,{"$f":"入力シート!O210","v":0},{"$f":"入力シート!R210","v":"各１パック"},{"$f":"入力シート!U210","v":"和室"}]
[null,null,{"$f":"入力シート!D211","v":0},{"$f":"入力シート!E211","v":0},"尿器類",null,{"$f":"入力シート!O211","v":0},{"$f":"入力シート!R211","v":0},{"$f":"入力シート!U211","v":0}]
[null,null,{"$f":"入力シート!D212","v":0},{"$f":"入力シート!E212","v":0},"カテーテル・バッグ等",null,{"$f":"入力シート!O212","v":0},{"$f":"入力シート!R212","v":0},{"$f":"入力シート!U212","v":0}]
[null,null,{"$f":"入力シート!D213","v":"■"},{"$f":"入力シート!E213","v":"■"},"おしりふき",null,{"$f":"入力シート!O213","v":0},{"$f":"入力シート!R213","v":"２パック"},{"$f":"入力シート!U213","v":"和室とバギー"}]
[null,null,{"$f":"入力シート!D214","v":0},{"$f":"入力シート!E214","v":0},"ストマ関連用品",null,{"$f":"入力シート!O214","v":0},{"$f":"入力シート!R214","v":0},{"$f":"入力シート!U214","v":0}]
[null,"口腔\n衛生",{"$f":"入力シート!D215","v":"■"},{"$f":"入力シート!E215","v":"■"},"歯ブラシ",null,{"$f":"入力シート!O215","v":0},{"$f":"入力シート!R215","v":"１本"},{"$f":"入力シート!U215","v":"バギー"}]
[null,null,{"$f":"入力シート!D216","v":"■"},{"$f":"入力シート!E216","v":"■"},"口腔ケアスポンジ",null,{"$f":"入力シート!O216","v":0},{"$f":"入力シート!R216","v":"３本"},{"$f":"入力シート!U216","v":"和室"}]
[null,null,{"$f":"入力シート!D217","v":0},{"$f":"入力シート!E217","v":0},"ガーゼ",null,{"$f":"入力シート!O217","v":0},{"$f":"入力シート!R217","v":0},{"$f":"入力シート!U217","v":0}]
[null,null,{"$f":"入力シート!D218","v":"■"},{"$f":"入力シート!E218","v":"■"},"紙コップ",null,{"$f":"入力シート!O218","v":0},{"$f":"入力シート!R218","v":"１２個"},{"$f":"入力シート!U218","v":"和室"}]
[null,"その他",{"$f":"入力シート!D219","v":"■"},{"$f":"入力シート!E219","v":"■"},"水",null,{"$f":"入力シート!O219","v":0},{"$f":"入力シート!R219","v":"3本"},{"$f":"入力シート!U219","v":"和室"}]
[null,null,{"$f":"入力シート!D220","v":0},{"$f":"入力シート!E220","v":0},"コミュニケーション用具",null,{"$f":"入力シート!O220","v":0},{"$f":"入力シート!R220","v":0},{"$f":"入力シート!U220","v":0}]
[null,null,{"$f":"入力シート!D221","v":"■"},{"$f":"入力シート!E221","v":"■"},"乾電池",null,{"$f":"入力シート!O221","v":0},{"$f":"入力シート!R221","v":"単４　2本"},{"$f":"入力シート!U221","v":"バギー"}]
[null,null,{"$f":"入力シート!D222","v":0},{"$f":"入力シート!E222","v":0},"携帯ラジオ",null,{"$f":"入力シート!O222","v":0},{"$f":"入力シート!R222","v":0},{"$f":"入力シート!U222","v":0}]
[null,null,{"$f":"入力シート!D223","v":"■"},{"$f":"入力シート!E223","v":"■"},"懐中電灯　（ベッド側にあるか）",null,{"$f":"入力シート!O223","v":0},{"$f":"入力シート!R223","v":0},{"$f":"入力シート!U223","v":"ベッド"}]
[null,null,{"$f":"入力シート!D224","v":"■"},{"$f":"入力シート!E224","v":"■"},"筆記用具",null,{"$f":"入力シート!O224","v":0},{"$f":"入力シート!R224","v":0},{"$f":"入力シート!U224","v":"母バック、ベッド"}]
[null,null,{"$f":"入力シート!D225","v":"■"},{"$f":"入力シート!E225","v":"■"},"保険証・医療受給者証",null,{"$f":"入力シート!O225","v":0},{"$f":"入力シート!R225","v":0},{"$f":"入力シート!U225","v":"母バック"}]
[null,null,{"$f":"入力シート!D226","v":"■"},{"$f":"入力シート!E226","v":"■"},"ティッシュ　・　ウエットティッシュ",null,{"$f":"入力シート!O226","v":0},{"$f":"入力シート!R226","v":0},{"$f":"入力シート!U226","v":"和室"}]
[null,null,{"$f":"入力シート!D227","v":"■"},{"$f":"入力シート!E227","v":"■"},"防寒具等",null,{"$f":"入力シート!O227","v":0},{"$f":"入力シート!R227","v":"各１まい"},{"$f":"入力シート!U227","v":"バギー"}]
[null,null,{"$f":"入力シート!D228","v":"■"},{"$f":"入力シート!E228","v":"■"},"クッション類",null,{"$f":"入力シート!O228","v":0},{"$f":"入力シート!R228","v":0},{"$f":"入力シート!U228","v":"バギーのもの"}]
[null,null,{"$f":"入力シート!D229","v":"■"},{"$f":"入力シート!E229","v":"■"},"使い捨て手袋",null,{"$f":"入力シート!O229","v":0},{"$f":"入力シート!R229","v":0},{"$f":"入力シート!U229","v":"和室"}]
[null,null,{"$f":"入力シート!D230","v":"■"},{"$f":"入力シート!E230","v":"■"},"ゴミ袋",null,{"$f":"入力シート!O230","v":0},{"$f":"入力シート!R230","v":0},{"$f":"入力シート!U230","v":"和室"}]
[null,null,{"$f":"入力シート!D231","v":"■"},{"$f":"入力シート!E231","v":"■"},"私の災害時個別計画（パーソナルプラン）",null,{"$f":"入力シート!O231","v":0},{"$f":"入力シート!R231","v":0},{"$f":"入力シート!U231","v":"ベッド"}]
[null,null,{"$f":"入力シート!D232","v":"■"},{"$f":"入力シート!E232","v":"■"},{"$f":"入力シート!F232","v":"チューブ類固定用テープ"},null,{"$f":"入力シート!O232","v":0},{"$f":"入力シート!R232","v":0},{"$f":"入力シート!U232","v":0}]
[null,null,{"$f":"入力シート!D233","v":"■"},{"$f":"入力シート!E233","v":"■"},{"$f":"入力シート!F233","v":"はさみ"},null,{"$f":"入力シート!O233","v":0},{"$f":"入力シート!R233","v":0},{"$f":"入力シート!U233","v":0}]

{"sheet":"12","index":12,"n_rows":49,"n_cols":2,"rows_kept":49,"cut":false,"hidden":false,"merged":[[48,1,48,46]]}
[]
[null,"☆  自宅見取り図　　※避難時の動線、充電場所も記入しましょう"]
[]
[]
[]
[]
[]
[]
[]
[]
[]
[]
[]
[]
[]
[]
[]
[]
[]
[]
[]
[]
[]
[]
[]
[]
[null,"☆   人工呼吸器の設定パネルの写真を貼りましょう"]
[]
[]
[]
[]
[]
[]
[]
[]
[]
[]
[]
[]
[]
[]
[]
[]
[]
[]
[]
[]
[]
[null,"☆　お薬手帳のコピーを貼りましょう"]

{"sheet":"13","index":13,"n_rows":48,"n_cols":3,"rows_kept":48,"cut":false,"hidden":false,"merged":[[21,1,21,25],[1,1,1,25],[2,1,2,25],[3,1,3,25],[4,1,4,25],[20,1,20,25]]}
[]
[null,"７．普段の私（　　　　さん）の様子"]
[null,"例えば・・・こんな時は不安になります　　　体調が悪いサイン"]
[null,"　　　　　　これがあると安心します　　　　大きな音や光が苦手です"]
[null,"　　　　　　楽な体勢の写真を貼りましょう"]
[]
[]
[]
[]
[]
[]
[]
[]
[]
[]
[]
[]
[]
[]
[]
[null,"８．週間予定（サービス等利用計画などの写し等）　"]
[null,"１日のスケジュール（栄養・内服の時間等）"]
[null,"時間","スケジュール"]
[null,"00:00:00",{"$f":"入力シート!D242","v":0}]
[null,null,{"$f":"入力シート!D243","v":0}]
[null,null,{"$f":"入力シート!D244","v":0}]
[null,null,{"$f":"入力シート!D245","v":0}]
[null,null,{"$f":"入力シート!D246","v":0}]
[null,null,{"$f":"入力シート!D247","v":0}]
[null,"06:00:00",{"$f":"入力シート!D248","v":0}]
[null,null,{"$f":"入力シート!D249","v":0}]
[null,null,{"$f":"入力シート!D250","v":"起床、口腔ケア、洗面、服薬"}]
[null,null,{"$f":"入力シート!D251","v":"ミキサー食３００～３５０ml"}]
[null,null,{"$f":"入力シート!D252","v":"月・木・土　ＡＭ入浴"}]
[null,null,{"$f":"入力シート!D253","v":"３日に１回　浣腸"}]
[null,"12:00:00",{"$f":"入力シート!D254","v":0}]
[null,null,{"$f":"入力シート!D255","v":"ミキサー食３００～３５０ml"}]
[null,null,{"$f":"入力シート!D256","v":"YouTube、テレビを見たり、音楽を聴いて過ごす"}]
[null,null,{"$f":"入力シート!D257","v":"YouTube、テレビを見たり、音楽を聴いて過ごす"}]
[null,null,{"$f":"入力シート!D258","v":"YouTube、テレビを見たり、音楽を聴いて過ごす"}]
[null,null,{"$f":"入力シート!D259","v":"YouTube、テレビを見たり、音楽を聴いて過ごす"}]
[null,"18:00:00",{"$f":"入力シート!D260","v":"YouTube、テレビを見たり、音楽を聴いて過ごす"}]
[null,null,{"$f":"入力シート!D261","v":0}]
[null,null,{"$f":"入力シート!D262","v":"ミキサー食３００～３５０ml"}]
[null,null,{"$f":"入力シート!D263","v":0}]
[null,null,{"$f":"入力シート!D264","v":"口腔ケア・服薬"}]
[null,null,{"$f":"入力シート!D265","v":"就寝"}]
[null,1,{"$f":"入力シート!D266","v":0}]

{"sheet":"14","index":14,"n_rows":41,"n_cols":5,"rows_kept":41,"cut":false,"hidden":false,"merged":[[18,1,18,4],[3,1,4,1],[5,1,9,1],[1,1,1,5],[2,1,2,4],[12,1,12,4],[13,1,13,4],[14,1,14,4],[15,1,15,4],[16,1,16,4],[17,1,17,4],[30,1,30,4],[19,1,19,4],[20,1,20,4],[21,1,21,4],[22,1,22,4],[23,1,23,4],[24,1,24,4],[25,1,25,4],[26,1,26,4],[27,1,27,4],[28,1,28,4],[29,1,29,4],[37,1,37,4],[38,1,38,4],[39,1,39,4],[40,1,40,4],[31,1,31,4],[32,1,32,4],[33,1,33,4],[34,1,34,4],[35,1,35,4],[36,1,36,4]]}
[]
[null,"９．災害から身を守るために"]
[null,"＊大規模災害では、災害発生の直後から公助が入るまでの間の数時間から数日間は、自助と共助で乗り切らなければいけません。具体的な対応策を考えておきましょう。"]
[null,null,"平常時","発災直後","発災24～72時間"]
[null,null,"（災害時の備え）","（発災時～避難まで）","（避難後～避難継続時）"]
[null,"自助","①   自宅の災害対策と避難準備","①   安否確認","①   関係者へ安否状況の連絡"]
[null,null,"②   安否確認の準備","②   被災状況の把握","②   必要な情報の確保"]
[null,null,"③   医療機器の取扱いと停電対策","③   ライフラインの情報収集と確保","③   医療の確保"]
[null,null,"④   医薬品や医療用品の確保","④　避難・自宅待機の意思決定"]
[null,null,"⑤   個別計画の策定"]
[null,"共助","⑥   地域（近隣・自主防災組等）との関係づくり","⑤　情報発信、協力要請"]
[]
[null,"　① 自宅の災害対策と避難準備　　　　　  ①　安否確認　　　　　　　　    　　   ①関係者へ安否状況の連絡"]
[null,"　　□家具や家電の転倒・落下防止対策　　  □本人・家族の身体状況の確認　　　　  □関係機関への安否連絡"]
[null,"　   □外出セットを準備　　　　　　　　 　 □人工呼吸器等の作動確認　　　　　　  □関係機関への連絡継続"]
[null,"　　□どのような状況なら避難するか、　　　　　　　　　　　　　　　　"]
[null,"        家族等と話し合い　　　　　　　　   ② 被災状況の把握　　　　            　 　②必要な情報の確保　　　　　　　　　　　　　　　　　　　"]
[null,"　② 安否確認の準備　                             □（台風等は）気象情報の確認      　　 □情報収集の継続"]
[null,"　　□災害時の情報を取れる方法を用意　     □自宅の被害状況を確認"]
[null,"      □災害時緊急連絡リストの作成と連　     □地域の被害状況を確認 　　　　　 　③医療の確保"]
[null,"　　  絡方法の確認                       　　　　　　　　　　　　　　            　　　　□治療薬、医療器具、医"]
[null,"　　□NTT災害用伝言ダイヤルの利用　    ③ライフラインの情報収集と確保　　      　　療材料の確保"]
[null,"        方法と練習　　　　　　　　　　　　  □電気、水、燃料の確認　　    　   　　 □病状悪化時の対応確認　　　　　　　　　　　　　                                                                          　　　　　　　　　　　　　　　　　　"]
[null,"　③ 医療機器の取扱いと停電対策　　　　    □中断時の対応　　                  　　　 □受診に向けての相談　"]
[null,"　　□停電対策、予備電源の確保　　　　　　　　　　　　　　　　　　　　"]
[null,"　　□手動式で使える医療機器の準備　　   ④避難・自宅待機の意思決定　　　"]
[null,"　　□医療機器の取り扱いの練習、介護　　  □避難の要否の判断　　　　　　　　　　　　　　"]
[null,"        者の確保　　　　　　　　　　　　 　 □家族や関係者への連絡　　　　　　　　　　　　　　　　　"]
[null,"　④ 医薬品や医療用品の確保　　　　　　　  　　　　                   "]
[null,"　　□治療薬、医療器具、医療材料の備蓄   ⑤情報発信、協力要請 　　　　　　 "]
[null,"　　□緊急時持ち出し物品の準備と保管場  　□近隣・自主防災組織への協力　　　　"]
[null,"        所の確認                                      　要請　　　　　　          　"]
[null,"　⑤ 個別計画の策定                       "]
[null,"　　□避難所・医療機関を確認　　　　　　"]
[null,"　　□避難経路を確認　　　　　　　　　　　　"]
[null,"　　□利用できるレスパイト先を検討"]
[null,"　　□緊急搬送あるいは避難方法を確認"]
[null,"　　□避難訓練の実施"]
[null,"　⑥ 地域との関係づくり"]
[null,"　　□普段からの近隣住民とのお付き合い"]
[null,"　　□避難行動要支援者名簿への登録"]

{"sheet":"15","index":15,"n_rows":34,"n_cols":5,"rows_kept":34,"cut":false,"hidden":false,"merged":[[33,1,37,1],[33,2,37,2],[33,3,37,3],[33,4,37,4],[18,1,22,1],[18,2,22,2],[18,3,22,3],[18,4,22,4],[23,1,27,1],[23,2,27,2],[23,3,27,3],[23,4,27,4],[2,1,2,4],[3,1,3,4],[28,1,32,1],[28,2,32,2],[28,3,32,3],[28,4,32,4],[8,1,12,1],[8,2,12,2],[8,3,12,3],[8,4,12,4],[13,1,17,1],[13,2,17,2],[13,3,17,3],[13,4,17,4]]}
[]
[null,"１０． 今後必要な備えについて　"]
[null,"＊今後備えが必要な事項を、P１３で話をしたことを参考に本人や家族・支援者等で洗い出し、計画的に準備をすすめましょう。"]
[null,"課題が解決したら、見直し時に計画に反映させることにより備えがより具体的になります。"]
[null,"項目","課題","行動計画（誰が、いつまで）","結果"]
[null,"（例）"]
[null,"指定避難場所がわからない","自宅からの経路が確認できていない","経路の確認","○年〇月"]
[null,null,null,"（本人、家族、訪問看護で、〇年〇月まで）","一緒に確認"]
[null,{"$f":"入力シート!A270","v":"安否確認、避難が必要になったり、物品の確保が必要な時の連絡体制"},{"$f":"入力シート!D270","v":"複数の連絡手段の\n確保が必要"},{"$f":"入力シート!J270","v":"・web171の登録\n・家族、医療機器メーカー、訪問看護、計画相談事業所、保健師で連絡体制の確認"},{"$f":"入力シート!P270","v":"R2.9.1 web171登録（訪問看護ステーションY、民生委員　はころさん、南保健センター）"}]
[]
[]
[]
[]
[null,{"$f":"入力シート!A271","v":"避難時の支援者の\n確保"},{"$f":"入力シート!D271","v":"避難が必要になった時に家族だけでは移動が困難な時の支援者の確保"},{"$f":"入力シート!J271","v":"・マンションの母親の知人にお願いしておく\n・いざという時の地域の支援者の確保の検討"},{"$f":"入力シート!P271","v":0}]
[]
[]
[]
[]
[null,{"$f":"入力シート!A272","v":"必要物品の準備"},{"$f":"入力シート!D272","v":"3日分は必要物品の\n確保が必要"},{"$f":"入力シート!J272","v":"・期日を決めて、必要物品の確認と保管場所の共有（家族、訪問看護、計画相談事業所、保健師など）"},{"$f":"入力シート!P272","v":0}]
[]
[]
[]
[]
[null,{"$f":"入力シート!A273","v":"電源の確保"},{"$f":"入力シート!D273","v":"停電が長引いたときの\n電源の確保が必要"},{"$f":"入力シート!J273","v":"・今後も電源確保に向けて検討"},{"$f":"入力シート!P273","v":0}]
[]
[]
[]
[]
[null,{"$f":"入力シート!A274","v":"身近な指定避難所の方が災害被害想定が大きい。\nどこに避難すればよいか分からない"},{"$f":"入力シート!D274","v":"安全な避難場所の確保"},{"$f":"入力シート!J274","v":"・安全で、電源確保可能な福祉避難所やショートステイの確保に向けて情報収集、施設等と相談していく\n・ぼうさいやどかりの登録"},{"$f":"入力シート!P274","v":"R2.8月　ぼうさいやどかり登録\n（I大学附属病院　神経内科）"}]
[]
[]
[]
[]
[null,{"$f":"入力シート!A275","v":0},{"$f":"入力シート!D275","v":0},{"$f":"入力シート!J275","v":0},{"$f":"入力シート!P275","v":0}]

{"sheet":"16","index":16,"n_rows":16,"n_cols":3,"rows_kept":16,"cut":false,"hidden":false,"merged":[[12,1,14,1],[12,2,14,2],[15,1,17,1],[15,2,17,2],[1,1,1,2],[3,1,5,1],[3,2,5,2],[6,1,8,1],[6,2,8,2],[9,1,11,1],[9,2,11,2]]}
[]
[null,"1１．個別計画（パーソナルプラン）作成の経過　"]
[null,"年月日","事　項"]
[null,{"$f":"入力シート!A278","v":"2019-09-03"},{"$f":"入力シート!D278","v":"災害時個別支援計画作成にあたっての情報共有（１回目）"}]
[]
[]
[null,{"$f":"入力シート!A279","v":"2019-10-17"},{"$f":"入力シート!D279","v":"災害時個別支援計画作成にあたっての情報共有（２回目）"}]
[]
[]
[null,{"$f":"入力シート!A280","v":"2019-12-24"},{"$f":"入力シート!D280","v":"災害時個別支援計画作成にあたっての情報共有（３回目）"}]
[]
[]
[null,{"$f":"入力シート!A281","v":"2020-02-26"},{"$f":"入力シート!D281","v":"災害時個別支援計画作成にあたっての情報共有（４回目）"}]
[]
[]
[null,{"$f":"入力シート!A282","v":"2020-06-25"},{"$f":"入力シート!D282","v":"災害時個別支援計画作成にあたっての情報共有（５回目）"}]

{"sheet":"17","index":17,"n_rows":62,"n_cols":35,"rows_kept":62,"cut":false,"hidden":false,"merged":[[1,1,1,42],[2,1,2,42]]}
[]
[null,"＊このページは、玄関に貼ることで、関係機関へ避難先を知らせるものになります。"]
[null,"必要時、ご活用ください。"]
[]
[null,null,"この家の住居人、"]
[]
[null,"　　　この家の住居人、"]
[]
[]
[]
[]
[]
[]
[]
[]
[null,"　　　　　　　月　　　　　　日　より"]
[]
[]
[]
[]
[]
[]
[null,"　　　　　　　　　　　避難中です。"]
[]
[]
[]
[]
[null,null,null,null,null,null,null,null,null,null,null,null,null,null,null,"月",null,null,null,null,null,null,null,null,null,null,null,null,null,null,null,null,null,null,"日　より"]
[]
[]
[]
[]
[]
[]
[]
[]
[]
[]
[]
[]
[]
[]
[]
[]
[]
[]
[]
[]
[]
[]
[]
[]
[]
[]
[]
[]
[]
[]
[]
[]
[]
[null,null,null,null,null,null,null,null,null,null,null,null,null,null,null,null,null,null,null,null,null,null,null,null,null,null,null,null,null,null,null,null,null,null,"避難中です"]

{"sheet":"個別避難計画様式","index":18,"n_rows":55,"n_cols":66,"rows_kept":55,"cut":false,"hidden":false,"merged":[[20,39,23,45],[6,46,9,58],[13,46,16,58],[20,46,23,58],[10,21,10,22],[3,0,3,4],[3,18,3,20],[0,0,1,7],[0,11,1,25],[0,27,1,33],[0,35,41,36],[4,0,5,4],[4,5,5,17],[4,18,5,20],[34,6,34,18],[4,21,5,33],[0,52,0,58],[10,28,10,29],[10,30,10,32],[11,4,11,8],[11,9,11,13],[11,14,11,22],[11,23,11,33],[1,52,3,58],[13,39,16,45],[13,30,13,31],[12,30,12,31],[12,7,12,11],[13,7,13,22],[6,37,12,38],[14,7,14,22],[9,6,9,23],[9,26,9,33],[0,59,0,64],[6,59,9,70],[12,12,12,16],[12,18,12,21],[4,37,5,38],[4,39,5,45],[4,46,5,58],[4,59,5,64],[4,65,5,70],[10,39,12,70],[1,37,3,43],[2,45,3,45],[0,65,0,70],[0,37,0,45],[0,46,0,51],[1,46,3,51],[1,59,3,64],[1,65,3,70],[6,39,9,45],[6,31,7,32],[6,33,7,33],[6,6,6,17],[6,18,7,20],[17,39,19,70],[18,6,18,18],[19,6,19,10],[19,13,19,18],[16,4,16,6],[16,15,16,18],[10,2,16,3],[20,59,23,70],[20,4,20,18],[20,19,20,33],[20,37,26,38],[21,4,21,18],[24,39,26,70],[23,19,23,20],[21,21,21,22],[21,24,21,27],[21,31,21,33],[22,4,22,18],[13,37,19,38],[19,23,19,25],[19,28,19,30],[13,59,16,70],[15,4,15,6],[16,19,16,22],[27,37,36,38],[28,0,47,1],[28,2,28,5],[28,16,28,17],[31,4,32,5],[37,4,37,5],[24,2,27,3],[24,4,27,33],[6,0,27,1],[6,2,9,3],[7,6,7,17],[29,2,40,3],[29,4,30,5],[29,6,29,7],[29,8,29,18],[29,19,30,20],[29,21,29,22],[29,23,29,33],[33,4,33,5],[33,6,33,18],[17,2,23,3],[17,4,17,18],[17,19,17,33],[16,29,16,32],[37,37,41,38],[37,39,41,70],[38,4,39,5],[38,6,39,18],[38,19,39,20],[38,21,39,33],[40,4,40,5],[42,35,47,70],[40,21,40,33],[40,6,40,18],[36,8,37,18],[36,23,37,33],[35,4,36,5],[35,6,35,7],[35,8,35,18],[35,19,36,20],[35,21,35,22],[35,23,35,33],[37,19,37,20],[27,39,36,70],[34,19,34,20],[34,21,34,33],[30,8,32,18],[30,23,32,33],[44,2,47,3],[44,4,47,33],[3,21,3,33],[3,5,3,17],[6,21,7,30],[8,26,8,33],[18,22,18,27],[18,28,18,33],[19,21,19,22],[41,2,43,3],[41,4,41,6],[41,7,41,18],[41,19,41,21],[41,22,41,33],[42,4,43,6],[42,7,43,18],[42,19,43,21],[42,22,43,33],[40,19,40,20],[21,19,21,20],[33,19,33,20],[33,21,33,33],[31,19,32,20],[34,4,34,5],[28,29,28,32],[22,19,22,22],[22,23,22,33],[23,21,23,33],[28,6,28,9],[28,10,28,11],[28,12,28,15],[28,18,28,21],[28,22,28,23],[28,24,28,27],[19,31,19,33],[8,4,9,5],[8,8,8,9],[8,11,8,23],[12,4,12,6],[13,4,13,6],[10,25,10,26],[23,4,23,6],[23,7,23,9],[23,10,23,12],[23,13,23,15],[23,16,23,18],[14,4,14,6],[14,23,14,26],[13,23,13,29],[10,10,10,11],[10,13,10,14],[10,15,10,16],[10,17,10,20],[10,4,10,6],[10,8,10,9],[15,9,15,33],[16,7,16,14],[14,27,14,28]]}
["（注）裏面あり",null,null,null,null,null,null,null,null,null,null,"岡山市個別避難計画",null,null,null,null,null,null,null,null,null,null,null,null,null,null,null,"福祉事業者作成様式",null,null,null,null,null,null,null,"C　避難の仕方（任意）",null,"住まいの状況",null,null,null,null,null,null,null,null,"洪水の危険性",null,null,null,null,null,"土砂災害の危険性",null,null,null,null,null,null,"津波の危険性",null,null,null,null,null,"高潮の危険性"]
[null,null,null,null,null,null,null,null,null,null,null,null,null,null,null,null,null,null,null,null,null,null,null,null,null,null,null,null,null,null,null,null,null,null,null,null,null,{"$f":"入力シート!T77","v":"戸建て"},null,null,null,null,null,null,null,null,{"$f":"入力シート!D27","v":"洪水時、０．５メートルの浸水被害の危険あり"},null,null,null,null,null,{"$f":"入力シート!D22","v":"なし"},null,null,null,null,null,null,{"$f":"入力シート!D17","v":"津波発生時、０．５メートル～1メートルの浸水被害の危険あり"},null,null,null,null,null,{"$f":"入力シート!D42","v":0}]
[null,null,null,null,null,null,null,null,null,null,null,null,null,null,null,null,null,null,null,null,null,null,null,null,null,null,null,null,null,null,null,null,null,null,null,null,null,null,null,null,null,null,null,null,null,{"$f":"入力シート!W77","v":2}]
["作成区分",null,null,null,null,{"$f":"入力シート!U3","v":"新規"},null,null,null,null,null,null,null,null,null,null,null,null,"作成日",null,null,{"$f":"入力シート!S1","v":"令和2　年　8　月　27　日"},null,null,null,null,null,null,null,null,null,null,null,null,null,null,null,null,null,null,null,null,null,null,"階"]
["作成事業所",null,null,null,null,{"$f":"入力シート!D3","v":"岡山市"},null,null,null,null,null,null,null,null,null,null,null,null,"作成者",null,null,{"$f":"入力シート!N3","v":"岡山"},null,null,null,null,null,null,null,null,null,null,null,null,null,null,null,"災害\n種別",null,"いつ\n（避難のタイミング）",null,null,null,null,null,null,"どこに\n（避難先）",null,null,null,null,null,null,null,null,null,null,null,null,"誰と\n（避難支援者）",null,null,null,null,null,"どうやって\n（移動方法）"]
[]
["A　本人に関する情報（必須）",null,"基本情報",null,"ふりがな",null,{"$f":"入力シート!D5","v":"おかやま　ももたろう"},null,null,null,null,null,null,null,null,null,null,null,"生年月日",null,null,{"$f":"入力シート!R6","v":1985},null,null,null,null,null,null,null,null,null,{"$f":"入力シート!U5","v":40},null,"歳　",null,null,null,"大雨",null,{"$f":"入力シート!F64","v":"大雨警戒レベル3以上や停電が長引く場合"},null,null,null,null,null,null,{"$f":"VLOOKUP(1,入力シート!A67:K72,6,FALSE)","v":"〇ふれあいセンター\n岡山市〇区〇〇"},null,null,null,null,null,null,null,null,null,null,null,null,{"$f":"VLOOKUP(1,入力シート!A67:W72,18,FALSE)","v":"ベッドから車までは、避難先①と同じ。\n車に乗車し移動。\n車が使用できない場合は、バギーに乗せて移動する。"}]
[null,null,null,null,"氏名",null,{"$f":"入力シート!D6","v":"岡山　桃太郎"}]
[null,null,null,null,"住所",null,"岡山市　　",null,null,null,"区",null,null,null,null,null,null,null,null,null,null,null,null,null,"性別",null,{"$f":"入力シート!O5","v":"男"}]
[null,null,null,null,null,null,{"$f":"入力シート!O7","v":"〒７００－××××　　　岡山市〇区"},null,null,null,null,null,null,null,null,null,null,null,null,null,null,null,null,null,"電話",null,{"$f":"入力シート!D79","v":"０８６－２××－××××（自宅）"}]
[null,null,"支援を必要とする事由",null,"要介護度",null,null,{"$f":"入力シート!F83","v":"有"},"要支援",null,{"$f":"入力シート!L83","v":0},null,null,"要介護",null,{"$f":"入力シート!P83","v":3},null,"障害手帳",null,null,null,"身体",null,null,{"$f":"入力シート!L82","v":"1級"},"知的",null,{"$f":"入力シート!V82","v":"A"},"精神",null,{"$f":"入力シート!P82","v":"1級"},null,null,"級"]
[null,null,null,null,"　障害支援区分",null,null,null,null,{"$f":"入力シート!V83","v":5},null,null,null,null,"　　指定難病医療受給者証",null,null,null,null,null,null,null,null,{"$f":"入力シート!O79","v":"有"}]
[null,null,null,null,"　移動",null,null,{"$f":"入力シート!F84","v":"全介助"},null,null,null,null,"杖・歩行器使用",null,null,null,null,{"$f":"入力シート!L84","v":"無"},"車いす使用",null,null,null,{"$f":"入力シート!P84","v":"無"},"担架・ストレッチャー使用",null,null,null,null,null,null,{"$f":"入力シート!V84","v":"有"}]
[null,null,null,null,"　視力",null,null,{"$f":"入力シート!K85","v":"見えにくい"},null,null,null,null,null,null,null,null,null,null,null,null,null,null,null,"眼鏡・コンタクト使用",null,null,null,null,null,null,{"$f":"入力シート!T85","v":"無"},null,null,null,null,null,null,"台風",null,{"$f":"入力シート!F65","v":"大型台風が予測され警戒レベル３以上の場合"},null,null,null,null,null,null,{"$f":"VLOOKUP(1,入力シート!B67:K72,5,FALSE)","v":"C施設\n岡山市北区〇〇"},null,null,null,null,null,null,null,null,null,null,null,null,{"$f":"VLOOKUP(1,入力シート!B67:W72,17,FALSE)","v":"ベッドから車までは、避難先①と同じ。\n車に乗車し移動。大雨の場合は、〇川が氾濫している恐れがある。災害状況を確認する。"}]
[null,null,null,null,"　聴力",null,null,{"$f":"入力シート!K86","v":"聞こえにくい"},null,null,null,null,null,null,null,null,null,null,null,null,null,null,null,"補聴器使用",null,null,null,{"$f":"入力シート!T86","v":"無"}]
[null,null,null,null,"　生活",null,null,"ADL",null,{"$f":"入力シート!D116","v":"・3時間ごとに体位変換必要\n・左の仙骨部横辺りに褥瘡ができやすい"}]
[null,null,null,null,"認知症",null,null,{"$f":"入力シート!V79","v":"有"},null,null,null,null,null,null,null,"意思疎通",null,null,null,"会話の可否",null,null,null,{"$f":"入力シート!F114","v":"否"},"筆談の可否",null,null,null,{"$f":"入力シート!L114","v":"否"},"意思伝達装置",null,null,null,{"$f":"入力シート!L115","v":"否"}]
[null,null,"医療福祉情報",null,"かかりつけ医",null,null,null,null,null,null,null,null,null,null,null,null,null,null,"ケアマネジャー・相談支援専門員"]
[null,null,null,null,"医院名",null,{"$f":"入力シート!D131","v":"K病院"},null,null,null,null,null,null,null,null,null,null,null,null,"事業所名",null,null,{"$f":"入力シート!D141","v":"玉手箱"},null,null,null,null,null,{"$f":"入力シート!D142","v":0}]
[null,null,null,null,"主治医",null,{"$f":"入力シート!J131","v":"小児外科　猿Dr"},null,null,null,null,"電話",null,{"$f":"入力シート!L131","v":"０８６－４２２－○○○○"},null,null,null,null,null,"担当",null,{"$f":"入力シート!J141","v":"青鬼さん"},null,{"$f":"入力シート!J142","v":0},null,null,"電話",null,{"$f":"入力シート!L141","v":"０８６－２４２－○○○○"},null,null,{"$f":"入力シート!L142","v":0}]
[null,null,null,null,"疾患・病歴・服薬など",null,null,null,null,null,null,null,null,null,null,null,null,null,null,"食事（アレルギー情報を含む）・トイレ・入浴など",null,null,null,null,null,null,null,null,null,null,null,null,null,null,null,null,null,"地震\n津波",null,{"$f":"入力シート!F66","v":"自宅マンションの倒壊などで避難が必要な場合"},null,null,null,null,null,null,{"$f":"VLOOKUP(1,入力シート!C67:K72,4,FALSE)","v":"K病院\n岡山市北区〇〇"},null,null,null,null,null,null,null,null,null,null,null,null,{"$f":"VLOOKUP(1,入力シート!C67:W72,16,FALSE)","v":"エレベーターが使用できないことが想定されるため、階段までは桃太郎君をバギーに乗せ、階段は以下のとおり4人で介助して１階まで降りる。\n二人でバギーに吸引器、呼吸器等をのせたまま本人の先を降りる。桃太郎くんを一人で横抱きにして、もう一人がサポートしながらバギーに続いて降りる（途中で吸引が必要になる可能性あり）。桃太郎君を抱いて移動する際はバギング不要。カニューレに人工鼻（サーモベントT）を装着。\n車に乗車し移動。道路状況を確認して経路を考える。車が使用できない時の方法の検討が必要。また、浸水被害を考え、車を安全な場所に移動しておくことが必要。"}]
[null,null,null,null,{"$f":"入力シート!D80","v":"ALS"},null,null,null,null,null,null,null,null,null,null,null,null,null,null,"食事",null,"胃ろう",null,{"$f":"入力シート!J106","v":"有"},"経鼻経管栄養",null,null,null,{"$f":"入力シート!J108","v":0},"その他",null,{"$f":"入力シート!M108","v":0}]
[null,null,null,null,{"$f":"入力シート!F81","v":"1999年筋生検（先天性筋ジストロフィー症、2014年（側弯症）脊椎固定術、（嚥下困難）胃ろう造設術、2016年（窒息による低酸素脳症）気管切開、腕頭動脈離断術、2017年喉頭気管分離術"},null,null,null,null,null,null,null,null,null,null,null,null,null,null,"アレルギー",null,null,null,{"$f":"入力シート!D94","v":"なし。"}]
[null,null,null,null,{"$f":"入力シート!D88","v":0},null,null,{"$f":"入力シート!D89","v":0},null,null,{"$f":"入力シート!D90","v":0},null,null,{"$f":"入力シート!D91","v":0},null,null,{"$f":"入力シート!D92","v":0},null,null,"トイレ",null,{"$f":"入力シート!F112","v":"全介助"}]
[null,null,"特記\n事項",null,{"$f":"入力シート!D119","v":"・カフエアーがぬけやすい。1～3時間おきにカフのエアー注入が必要。（リーク音かアラーム音が鳴る）\n・気管孔周囲が過敏なため、少しの刺激でむせやすく、胃からの逆流が起こりやすい。\n　呼吸器無しでの移動時等もむせるためバギング不要（サーモベントＴ：人口鼻使用）"}]
[]
[]
[null,null,null,null,null,null,null,null,null,null,null,null,null,null,null,null,null,null,null,null,null,null,null,null,null,null,null,null,null,null,null,null,null,null,null,null,null,"何を持って（持出品）",null,"シート10、11参照"]
["B 避難支援に関する情報（必須）",null,"家族構成",null,null,null,{"$f":"入力シート!B124","v":"岡山　一郎"},null,null,null,{"$f":"入力シート!F124","v":"父"},null,{"$f":"入力シート!B125","v":"岡山　桃子"},null,null,null,{"$f":"入力シート!F125","v":"母"},null,{"$f":"入力シート!B126","v":0},null,null,null,{"$f":"入力シート!F126","v":0},null,{"$f":"入力シート!B127","v":0},null,null,null,{"$f":"入力シート!F127","v":0},{"$f":"入力シート!B128","v":0},null,null,null,{"$f":"入力シート!F128","v":0}]
[null,null,"避難支援者（緊急連絡先を含む）",null,"候補①",null,null,null,null,null,null,null,null,null,null,null,null,null,null,"候補②"]
[null,null,null,null,null,null,"名称",null,{"$f":"VLOOKUP(1,入力シート!A130:I149,4,FALSE)","v":"訪問看護ステーションE"},null,null,null,null,null,null,null,null,null,null,null,null,"名称",null,{"$f":"VLOOKUP(2,入力シート!A130:I149,4,FALSE)","v":"鬼が島"}]
[null,null,null,null,"住所",null,null,null,null,null,null,null,null,null,null,null,null,null,null,"住所"]
[]
[null,null,null,null,"電話",null,{"$f":"VLOOKUP(1,入力シート!A131:O149,12,FALSE)","v":"０８６－２３９－○○○○"},null,null,null,null,null,null,null,null,null,null,null,null,"電話",null,{"$f":"VLOOKUP(2,入力シート!A131:O149,12,FALSE)","v":"０８６－２４１－○○○○"}]
[null,null,null,null,"関係",null,{"$f":"VLOOKUP(1,入力シート!A131:O149,2,FALSE)","v":"訪問看護"},null,null,null,null,null,null,null,null,null,null,null,null,"関係",null,{"$f":"VLOOKUP(2,入力シート!A131:O149,2,FALSE)","v":"医療機器業者"}]
[null,null,null,null,"候補③",null,null,null,null,null,null,null,null,null,null,null,null,null,null,"候補④"]
[null,null,null,null,null,null,"名称",null,{"$f":"VLOOKUP(3,入力シート!A130:I149,4,FALSE)","v":"玉手箱"},null,null,null,null,null,null,null,null,null,null,null,null,"名称",null,{"$f":"VLOOKUP(4,入力シート!A130:I149,4,FALSE)","v":"K病院"}]
[null,null,null,null,"住所",null,null,null,null,null,null,null,null,null,null,null,null,null,null,"住所",null,null,null,null,null,null,null,null,null,null,null,null,null,null,null,null,null,"特記\n事項"]
[null,null,null,null,"電話",null,{"$f":"VLOOKUP(3,入力シート!A131:O149,12,FALSE)","v":"０８６－２４２－○○○○"},null,null,null,null,null,null,null,null,null,null,null,null,"電話",null,{"$f":"VLOOKUP(4,入力シート!A131:O149,12,FALSE)","v":"０８６－４２２－○○○○"}]
[]
[null,null,null,null,"関係",null,{"$f":"VLOOKUP(3,入力シート!A131:O149,2,FALSE)","v":"障害者計画相談支援事業所"},null,null,null,null,null,null,null,null,null,null,null,null,"関係",null,{"$f":"VLOOKUP(4,入力シート!A131:O149,2,FALSE)","v":"かかりつけ医①"}]
[null,null,"避難先",null,"候補①",null,null,{"$f":"入力シート!F68","v":"K病院\n岡山市北区〇〇"},null,null,null,null,null,null,null,null,null,null,null,"候補②",null,null,{"$f":"入力シート!F70","v":"C施設\n岡山市北区〇〇"}]
[null,null,null,null,"移動方法・\n経路等",null,null,{"$f":"入力シート!R68","v":"エレベーターが使用できないことが想定されるため、階段までは桃太郎君をバギーに乗せ、階段は以下のとおり4人で介助して１階まで降りる。\n二人でバギーに吸引器、呼吸器等をのせたまま本人の先を降りる。桃太郎くんを一人で横抱きにして、もう一人がサポートしながらバギーに続いて降りる（途中で吸引が必要になる可能性あり）。桃太郎君を抱いて移動する際はバギング不要。カニューレに人工鼻（サーモベントT）を装着。\n車に乗車し移動。道路状況を確認して経路を考える。車が使用できない時の方法の検討が必要。また、浸水被害を考え、車を安全な場所に移動しておくことが必要。"},null,null,null,null,null,null,null,null,null,null,null,"移動方法・\n経路等",null,null,{"$f":"入力シート!R70","v":"ベッドから車までは、避難先①と同じ。\n車に乗車し移動。大雨の場合は、〇川が氾濫している恐れがある。災害状況を確認する。"},null,null,null,null,null,null,null,null,null,null,null,null,"　※避難支援者等の皆さまへ（以下の内容についてご理解いただけますようお願いいたします。）\n　○　避難支援は支援者自身の安全が確保できる範囲で行っていただくものであり、責任を問われたり、\n　　　義務を負うものではありません。\n　○　計画に記載された情報は、平時から関係者間で共有され、災害時には避難支援等の活動に活用されます。\n"]
[]
[null,null,"特記\n事項"]
[]
[]
[]
[]
[null,null,null,null,null,null,null,null,null,null,null,null,null,null,null,null,null,null,null,null,null,null,null,null,null,null,null,null,null,null,null,null,null,null,null,"　"]
[]
[]
[]
[]
[null,null,null,null,null,null,null,null,null,null,null,null,null,null,null,null,null,null,null,null,null,null,null,null,null,null,null,null,null,null,null,null,null,null,null,null,null,null,null,null,null,null,"　"]