{"text_format":"1","workbook":"xlsx","n_sheets":19,"sheets":["メイン画面","マスタ (申請・工事業者)","マスタ（浄化槽）","入力","申請審査票","交付申請書","覚書","実績報告審査票","実績報告書","変更届出書","チェックリスト","交付請求書","口振依頼書","変更等承認","移管データ","見積額調書(提出不要・削除禁止)","収支決算及び実績額(提出不要・削除禁止)","【編集不可】マスタ","【編集不可】補助要件マスタ"],"not_rendered":{"charts":0,"images":0,"macros":1,"external_links":1,"defined_names":760,"comments":3,"pivot_tables":0},"unopened":[],"bounds":{"document_bytes":16777216,"sheet_cells":100000,"rows_first":2000,"rows_last":500,"rows_between":2000,"halvings":0,"cell_chars":16384,"cell_head_chars":4096},"cells_cut":0,"cells_raw":0,"read":"whole","date_system":"1900"}

{"sheet":"メイン画面","index":0,"n_rows":40,"n_cols":22,"rows_kept":40,"cut":false,"hidden":false,"merged":[[0,1,0,20],[25,12,34,12],[25,1,34,1],[13,1,19,1],[13,12,19,12],[10,1,11,1],[3,1,5,3],[37,1,38,3],[33,21,35,23],[6,1,8,1],[22,1,23,3],[39,12,41,12],[39,1,41,1]]}
[null,"作　成　支　援　様　式　メ　イ　ン　画　面"]
[]
[]
[null,"初期設定"]
[]
[]
{"$rows_left_out":35}
{"sheet":"マスタ (申請・工事業者)","index":1,"n_rows":54,"n_cols":11,"rows_kept":54,"cut":false,"hidden":false,"merged":[]}
["No","商号","〒","住所","電話","登録／届出","登録（届出）年度\n■■第・・・号","登録（届出）番号\n第■■号","担当者・設備士","免状番号","修了番号"]
["例","〇〇設備(株)","700-0913","岡山市北区大供一丁目１－１","086-803-1000","登録",5,1000,"岡山　一郎",12345678,87654321]
[1]
[2]
[3]
[4]
{"$rows_left_out":49}
{"sheet":"マスタ（浄化槽）","index":2,"n_rows":24,"n_cols":5,"rows_kept":24,"cut":false,"hidden":false,"merged":[]}
["No","型式","メーカー","全浄協登録番号","型式認定番号"]
["例","ABC-1","(株)〇〇",1234567,"1-23A-B-456-7"]
[1,"CA-5","フジクリーン",2810602,"5-19K-H-007"]
[2,"CA-7","フジクリーン",2810602,"5-19K-H-007-1"]
[3,"CA-10","フジクリーン",2810602,"5-19K-H-007-2"]
[4,"KZⅡ-5","クボタ",2880301,"6-23K-H-001"]
{"$rows_left_out":19}
{"sheet":"入力","index":3,"n_rows":83,"n_cols":11,"rows_kept":83,"cut":false,"hidden":false,"merged":[[45,0,53,0],[7,2,7,9],[8,2,8,9],[42,0,43,0],[41,2,41,9],[35,0,41,0],[36,2,36,9],[52,6,52,9],[52,2,52,5],[35,2,35,4],[45,2,45,9],[50,2,50,9],[23,0,26,0],[31,2,31,9],[32,2,32,9],[33,2,33,9],[63,0,67,0],[69,0,73,0],[74,0,76,0],[71,2,71,9],[67,2,67,9],[72,2,72,9],[70,2,70,9],[74,2,74,9],[66,2,66,9],[73,2,73,3],[73,7,73,8],[73,4,73,5],[69,2,69,9],[63,2,63,9],[75,2,75,9],[76,2,76,9],[65,2,65,9],[64,2,64,9],[61,4,61,9],[61,2,61,3],[53,6,53,9],[53,2,53,5],[54,2,54,5],[57,6,57,9],[57,2,57,5],[59,6,59,9],[59,2,59,5],[58,2,58,5],[58,6,58,9],[28,2,28,9],[29,2,29,9],[30,2,30,9],[23,3,23,9],[28,0,34,0],[24,3,24,9],[26,3,26,9],[34,2,34,9],[25,2,25,9],[54,0,60,0],[54,6,54,9],[55,6,55,9],[56,6,56,9],[55,2,55,5],[56,2,56,5],[13,2,13,9],[12,2,12,9],[21,6,21,9],[9,2,9,9],[20,0,20,5],[19,6,19,9],[20,6,20,9],[16,2,16,9],[15,2,15,9],[14,2,14,9],[18,0,18,9],[19,0,19,5],[0,0,16,0],[21,0,21,5],[0,2,0,5],[0,6,0,9],[1,2,1,9],[5,2,5,9],[3,2,3,5],[11,2,11,9],[10,2,10,9],[6,2,6,9],[4,2,4,5],[4,6,4,9],[51,2,51,9],[46,2,46,9],[49,2,49,9],[42,2,42,9],[43,2,43,9],[47,2,47,9],[35,5,35,9],[39,2,39,9],[40,2,40,9],[48,2,48,9],[37,2,37,9],[38,2,38,9]]}
["申請者に関する情報",null,"申請",null,null,null,"実績"]
[null,"申請年度（令和）",7,null,null,null,null,null,null,null,"和暦の数字のみ入力"]
[null,"申請(左)/実績報告(右)　月日",null,"月",null,"日",null,"月",null,"日","※事前申請ではなく、正式受付日を入力（左）申請月日（右）実績報告月日をドロップダウンから選択"]
[null,"交付決定日",null,null,null,null,null,"月",null,"日","（右）交付決定通知月日"]
[null,"交付決定番号",null,null,null,null,null,null,null,null,"（右）交付決定通知書の岡山市指令環保浄第■■号の番号"]
[null,"〒",null,null,null,null,null,null,null,null,"ハイフンを入れない7桁数字"]
{"$rows_left_out":78}
{"sheet":"申請審査票","index":4,"n_rows":60,"n_cols":57,"rows_kept":60,"cut":false,"hidden":false,"merged":[[39,19,39,26],[39,27,39,28],[39,29,39,34],[16,0,16,13],[35,5,36,49],[47,0,48,3],[47,4,48,9],[47,10,48,46],[18,0,45,3],[44,5,44,50],[47,47,48,53],[29,5,30,49],[31,5,32,49],[39,36,39,48],[38,5,38,6],[33,5,34,49],[39,7,39,16],[39,17,39,18],[59,0,60,3],[59,4,60,9],[59,10,59,46],[59,47,60,53],[60,10,60,46],[49,47,50,53],[50,10,50,46],[57,0,58,3],[57,4,58,9],[57,10,57,46],[57,47,58,53],[58,10,58,46],[51,0,52,3],[49,0,50,3],[49,4,50,9],[49,10,49,46],[55,10,55,46],[55,47,56,53],[56,10,56,46],[51,47,52,53],[52,10,52,46],[53,0,56,3],[53,4,54,9],[53,10,53,46],[51,4,52,9],[51,10,51,46],[53,47,54,53],[54,10,54,46],[55,4,56,9],[12,1,12,2],[12,13,12,20],[12,11,12,12],[12,21,12,25],[12,31,12,33],[12,26,12,29],[12,3,12,10],[22,5,23,45],[41,5,41,6],[39,5,39,6],[40,5,40,6],[37,7,37,12],[38,7,38,12],[40,7,40,12],[41,7,41,12],[37,14,37,48],[16,20,16,31],[16,32,16,52],[16,14,16,19],[1,10,1,41],[3,1,3,33],[5,0,5,2],[5,3,5,8],[5,12,5,14],[5,15,5,23],[5,27,5,35],[9,6,9,10],[9,11,9,53],[7,0,8,5],[7,6,8,6],[7,7,8,32],[7,33,7,38],[7,39,8,53],[8,33,8,38],[12,42,12,45],[14,0,14,13],[14,14,14,52],[15,0,15,13],[15,14,15,52],[38,14,38,48],[40,14,40,48],[41,14,41,48],[9,0,9,5],[10,0,10,5],[11,0,11,5],[11,6,11,27],[11,28,11,31],[12,34,12,41],[12,47,12,49],[10,40,10,52],[10,6,10,38],[11,40,11,52],[11,32,11,38],[19,5,20,45],[21,22,21,51],[21,17,21,20],[25,5,28,49],[37,5,37,6]]}
[]
[null,null,null,null,null,null,null,null,null,null,"合併浄化槽設置補助金申請審査票"]
[]
[null,"太線の中を記入し、該当する項目にチェック(レ)してください。"]
[]
["年度",null,null,{"$f":"ASC(入力!C2)","v":"7"},null,null,null,null,null,null,null,null,"番号",null,null,null,null,null,null,null,null,null,null,null,null,null,null,"正式　　 ／"]
{"$rows_left_out":55}
{"sheet":"交付申請書","index":5,"n_rows":99,"n_cols":57,"rows_kept":99,"cut":false,"hidden":false,"merged":[[68,27,68,42],[68,10,68,12],[69,10,69,12],[5,1,5,11],[7,2,7,4],[7,5,7,6],[7,7,7,53],[0,1,0,16],[2,13,2,38],[4,37,4,39],[4,40,4,42],[4,43,4,44],[16,10,16,13],[16,15,16,54],[17,1,18,7],[17,17,17,44],[18,10,18,13],[18,15,18,44],[8,1,8,53],[9,2,9,53],[10,1,10,40],[12,2,12,53],[20,1,20,7],[20,10,20,13],[20,15,20,42],[22,19,22,33],[26,1,29,7],[28,10,30,18],[28,20,28,22],[30,20,30,27],[30,29,30,55],[33,0,33,13],[34,1,35,9],[36,1,39,9],[36,11,37,16],[36,17,37,28],[36,29,37,32],[36,33,37,37],[36,38,37,46],[36,47,37,56],[38,11,39,15],[38,16,39,27],[38,28,39,35],[38,36,39,56],[40,1,43,9],[40,11,40,20],[40,21,40,22],[40,23,40,36],[41,32,41,33],[41,34,41,44],[44,1,47,9],[44,11,44,25],[44,26,44,27],[44,43,44,44],[47,11,47,20],[47,21,47,32],[47,33,47,34],[47,35,47,44],[41,45,41,46],[41,54,41,55],[42,32,42,33],[42,34,42,44],[42,45,42,46],[42,48,42,53],[42,54,42,55],[44,55,44,56],[45,11,45,20],[45,21,45,32],[45,33,45,34],[45,35,45,44],[45,45,45,54],[45,55,45,56],[43,32,43,33],[43,34,43,44],[43,45,43,46],[43,48,43,53],[43,54,43,55],[44,28,44,42],[47,45,47,54],[47,55,47,56],[46,11,46,20],[46,21,46,32],[46,33,46,34],[46,35,46,44],[46,45,46,54],[46,55,46,56],[51,45,51,53],[51,55,51,56],[48,54,48,56],[49,1,51,9],[49,11,49,12],[49,13,49,26],[49,27,49,41],[49,42,49,54],[49,55,49,56],[50,11,51,12],[48,1,48,9],[48,11,48,12],[48,13,48,23],[54,1,54,9],[54,11,54,13],[54,43,54,56],[53,13,53,23],[52,43,52,45],[52,46,52,47],[52,48,52,50],[52,51,52,53],[53,1,53,9],[53,11,53,12],[52,1,52,9],[52,15,52,29],[52,32,52,33],[52,35,52,37],[52,38,52,40],[52,41,52,42],[54,32,54,42],[88,1,89,19],[95,34,95,36],[4,45,4,47],[4,48,4,49],[4,50,4,52],[4,53,4,54],[15,11,15,13],[66,10,66,56],[67,10,67,56],[60,10,60,13],[60,14,60,31],[62,1,65,7],[62,10,62,13],[62,14,62,31],[65,11,65,56],[55,1,55,9],[55,11,55,13],[53,25,53,39],[48,25,48,39],[15,15,15,18],[28,24,28,55],[34,11,35,16],[34,17,35,56],[41,48,41,53],[55,14,55,31],[55,41,55,56],[56,41,56,56],[58,10,58,13],[58,14,58,55],[53,41,53,42],[53,43,53,47],[53,48,53,54],[50,13,50,26],[50,27,50,41],[50,42,50,54],[50,55,50,56],[51,13,51,22],[51,23,51,30],[51,32,51,44],[55,32,55,40],[54,14,54,31]]}
[null,"様式第１号（第６条関係）"]
[]
[null,null,null,null,null,null,null,null,null,null,null,null,null,"補　助　金　交　付　申　請　書"]
[null,null,null,null," "]
[null,null,null,null,null,null,null,null,null,null,null,null,null,null,null,null,null,null,null,null,null,null,null,null,null,null,null,null,null,null,null,null,null,null,null,null,null,"令和",null,null,{"$f":"ASC(IF(入力!C3=0,\"\",IF(入力!C3<4,入力!C2+1,入力!C2)))","v":""},null,null,"年",null,{"$f":"ASC(入力!C3)","v":""},null,null,"月",null,{"$f":"ASC(入力!E3)","v":""},null,null,"日"]
[null,"岡 山 市 長   様"]
{"$rows_left_out":94}
{"sheet":"覚書","index":6,"n_rows":35,"n_cols":17,"rows_kept":35,"cut":false,"hidden":false,"merged":[[0,0,0,2],[22,14,22,16],[12,2,13,10],[4,1,4,2],[14,3,14,4],[19,14,19,15]]}
["浄化槽工事の適正な施工の確保に関する覚書",null,null,null,null,null,null,null,null,null,null,null,"第６条","　甲は、合併処理浄化槽設置整備事業実施要項（平成６年１０月"]
[null,null,null,null,null,null,null,null,null,null,null,null,null,"２０日付衛浄第６５号厚生省生活衛生局水道環境部長通知別紙）"]
["発注者　　　　　 　　　 　　　　",{"$f":"DBCS(IF(入力!C9=0,\"\",入力!C9))","v":""},"（以下「甲」という。）及び浄化槽",null,null,null,null,null,null,null,null,null,null,"第３の(5)のアの規定に基づく検査の結果､改善を要すると指摘を"]
[null,null,null,null,null,null,null,null,null,null,null,null,null,"受けた場合は、乙に対し相当の期限を定めてその瑕疵の修補を請"]
["工事業者　　　　　　　　　　　　　　　　 ",{"$f":"DBCS(入力!C72)","v":""},null,"（以下「乙」という。）は、",null,null,null,null,null,null,null,null,null,"求することができる。"]
["岡山市合併処理浄化槽設置整備事業補助金（以下「補助金」という。） ",null,null,null,null,null,null,null,null,null,null,null,2,"　甲は、法第７条の規定による、水質に関する検査を受け、その"]
{"$rows_left_out":30}
{"sheet":"実績報告審査票","index":7,"n_rows":39,"n_cols":34,"rows_kept":39,"cut":false,"hidden":false,"merged":[[10,0,10,6],[10,7,10,9],[4,0,5,2],[4,3,5,7],[4,8,4,24],[10,16,11,35],[10,14,11,15],[11,0,12,6],[8,0,8,2],[8,3,8,10],[8,11,8,13],[8,14,8,16],[8,17,8,20],[11,10,12,10],[8,21,8,35],[11,8,12,8],[0,0,0,35],[5,8,5,24],[6,0,6,2],[6,3,6,7],[6,8,6,10],[6,11,6,35],[24,0,25,6],[25,14,27,35],[13,0,13,6],[13,14,14,35],[14,0,14,6],[15,0,15,6],[16,0,16,6],[17,0,17,6],[17,14,18,16],[18,0,19,6],[19,14,20,16],[19,17,20,25],[20,0,21,6],[21,14,23,16],[22,0,23,6],[26,0,26,6],[27,0,28,6],[27,10,27,12],[28,14,29,15],[29,0,29,6],[29,7,29,9],[29,10,29,12],[34,0,34,1],[34,2,34,4],[34,5,34,32],[34,33,34,35],[32,0,32,1],[32,2,32,4],[32,5,32,32],[32,33,32,35],[33,0,33,1],[33,2,33,4],[33,5,33,32],[33,33,33,35],[35,0,36,1],[35,2,35,4],[35,5,35,32],[35,33,35,35],[36,2,36,4],[36,5,36,32],[36,33,36,35],[37,0,37,1],[37,2,37,4],[37,5,37,32],[37,33,37,35],[38,0,38,1],[38,2,38,4],[38,5,38,32],[38,33,38,35],[18,8,19,8],[20,8,26,8],[27,8,28,8],[11,7,12,7],[11,9,12,9],[18,7,19,7],[18,9,19,9],[20,7,26,7],[20,9,26,9],[27,7,28,7],[27,9,28,9],[15,14,16,16],[15,17,16,35],[21,17,23,35],[28,16,29,28],[30,16,30,35],[30,14,30,15],[28,29,29,35],[19,26,20,28],[19,29,20,35],[11,38,12,38],[18,38,19,38],[20,38,26,38],[27,38,28,38],[17,17,18,35]]}
["実　績　報　告　審　査　票"]
[]
["提出書類・写真を確認の上、太線の中を記入し提出してください。"]
[]
["交付決定\n番　　号",null,null,"補助事業者氏名",null,null,null,null,{"$f":"DBCS(IF(入力!C8=0,\"\",入力!C8))","v":""}]
[null,null,null,null,null,null,null,null,{"$f":"DBCS(IF(入力!C9=0,\"\",入力!C9))","v":""}]
{"$rows_left_out":34}
{"sheet":"実績報告書","index":8,"n_rows":41,"n_cols":19,"rows_kept":41,"cut":false,"hidden":false,"merged":[[38,13,38,19],[32,10,32,14],[33,10,33,14],[35,10,35,14],[36,10,36,14],[32,15,32,17],[34,10,34,14],[34,15,34,17],[37,10,37,14],[37,15,37,17],[33,15,33,17],[32,1,32,4],[36,1,36,4],[30,1,30,9],[32,5,32,8],[36,15,36,17],[35,15,35,17],[31,1,31,9],[31,10,31,18],[37,5,37,8],[34,1,34,4],[34,5,34,8],[37,1,37,4],[33,1,33,4],[35,1,35,4],[35,5,35,8],[33,5,33,8],[36,5,36,8],[27,2,27,18],[29,2,29,18],[28,1,28,9],[22,5,22,6],[22,7,22,18],[26,1,26,9],[23,13,23,18],[24,13,24,18],[24,4,24,9],[23,10,23,12],[24,10,24,12],[25,12,25,17],[26,12,26,13],[2,0,2,18],[25,1,25,9],[22,1,22,4],[4,12,4,13],[11,12,11,18],[16,0,16,18],[18,0,18,18],[14,17,14,18],[20,0,20,18],[14,0,14,1],[14,10,14,15],[14,2,14,3],[14,7,14,8],[24,1,24,3],[23,4,23,9],[8,12,10,18]]}
["様式第５号（第９条関係）"]
[]
["実　　績　　報　　告　　書"]
[]
[null,null,null,null,null,null,null,null,null,null,null,"令和",{"$f":"ASC(IF(入力!G3=0,\"\",IF(入力!G3<4,入力!C2+1,入力!C2)))","v":""},null,"年",{"$f":"ASC(入力!G3)","v":""},"月",{"$f":"ASC(入力!I3)","v":""},"日"]
[]
{"$rows_left_out":36}
{"sheet":"変更届出書","index":9,"n_rows":37,"n_cols":20,"rows_kept":37,"cut":false,"hidden":false,"merged":[[22,17,36,17],[23,13,24,13],[23,14,24,14],[13,12,15,16],[8,10,8,11],[16,12,16,16],[32,15,33,15],[32,16,33,16],[35,15,36,15],[35,16,36,16],[22,5,22,8],[22,9,22,12],[19,1,19,15],[21,1,21,4],[21,5,21,8],[21,9,21,12],[21,13,21,16],[22,13,22,14],[3,14,4,15],[2,2,2,3],[2,4,2,6],[2,7,2,8],[2,9,2,10],[2,11,2,13],[2,14,2,15],[3,2,4,3],[3,4,4,6],[3,7,4,8],[3,9,4,10],[3,11,4,13],[6,2,6,15],[23,15,24,15],[23,16,24,16],[25,1,27,4],[25,13,25,14],[26,13,27,13],[26,14,27,14],[26,15,27,15],[26,16,27,16],[23,5,23,8],[24,5,24,8],[23,9,23,12],[24,9,24,12],[25,5,25,8],[25,9,25,12],[22,1,24,4],[26,5,26,8],[29,15,30,15],[29,16,30,16],[30,5,30,8],[30,9,30,12],[26,9,26,12],[27,5,27,8],[27,9,27,12],[28,1,30,4],[28,5,28,8],[28,9,28,12],[28,13,28,14],[29,5,29,8],[29,9,29,12],[29,13,30,13],[29,14,30,14],[31,1,33,4],[31,5,31,8],[31,9,31,12],[31,13,31,14],[32,5,32,8],[32,9,32,12],[32,13,33,13],[32,14,33,14],[33,5,33,8],[33,9,33,12],[34,1,36,4],[34,5,34,8],[34,9,34,12],[34,13,34,14],[35,5,35,8],[35,9,35,12],[35,13,36,13],[35,14,36,14],[36,5,36,8],[36,9,36,12]]}
[null,"（第８条関係）"]
[]
[null,null,"課　　長",null,"課 長 代 理",null,null,"課長補佐",null,"主　　任",null,"課　　　　員",null,null,"担当者"]
[]
[]
[]
{"$rows_left_out":32}
{"sheet":"チェックリスト","index":10,"n_rows":49,"n_cols":10,"rows_kept":49,"cut":false,"hidden":false,"merged":[[37,0,38,0],[37,1,38,1],[38,2,38,4],[42,2,42,5],[42,9,42,12],[41,2,41,5],[39,0,42,0],[39,1,42,1],[39,2,39,4],[40,2,40,4],[37,2,37,4],[17,0,18,0],[16,2,16,4],[7,2,7,3],[19,1,23,1],[19,0,25,0],[24,2,24,4],[25,2,25,4],[8,2,8,4],[13,2,13,4],[14,2,14,4],[15,2,15,4],[9,2,9,3],[17,1,18,1],[17,2,17,4],[18,2,18,3],[18,4,18,5],[0,0,0,1],[1,0,1,1],[7,9,7,10],[18,9,18,10],[41,9,41,12],[3,0,5,0],[3,2,3,4],[4,2,4,4],[5,2,5,4],[10,0,12,0],[10,1,12,1],[10,2,10,4],[11,2,11,4],[12,2,12,4],[6,2,6,4],[7,4,7,5],[0,4,0,5],[1,4,1,5],[2,2,2,4],[31,2,31,4],[32,2,32,4],[19,2,19,4],[20,2,20,4],[21,2,21,4],[22,2,22,4],[23,2,23,4],[30,0,36,0],[30,2,30,4],[33,2,33,4],[26,0,29,0],[26,2,26,4],[27,2,27,4],[28,2,28,4],[29,2,29,4],[34,2,34,4],[35,2,35,4],[36,2,36,4],[30,1,33,1],[26,1,27,1],[48,2,48,4],[43,0,47,0],[43,1,47,1],[43,2,43,4],[44,2,44,4],[45,2,45,4],[46,2,46,4],[47,2,47,4]]}
["補助事業者氏名",null,{"$f":"DBCS(IF(入力!C9=0,\"\",入力!C9))","v":""},"浄化槽設備士氏名",{"$f":"I1","v":""},null,null,{"$f":"変更届出書!J23&変更届出書!J26&変更届出書!J29&変更届出書!J32&変更届出書!J35","v":""},{"$f":"IF(AND(変更届出書!J23=0,変更届出書!J26=0,変更届出書!J29=0,変更届出書!J32=0,変更届出書!J35=0),交付申請書!O56,H1)","v":""}]
["設置場所",null,{"$f":"入力!C35","v":""},"免状(修了)番号",{"$f":"I3","v":""},null,"一括チェック"]
["写真NO.","工程","チ　ェ　ッ　ク　ポ　イ　ン　ト",null,null,null,null,{"$f":"変更届出書!J25&変更届出書!J28&変更届出書!J31&変更届出書!J34&変更届出書!J37","v":""},{"$f":"IF(COUNTBLANK(H3)<>0,交付申請書!AP56,H3)","v":""}]
[null,"着工前写真","浄化槽設備士、標識板、工事看板及び埋設予定場所全体が、周囲の状況とともに写っているか。また、宅内配管工事費用及び便槽撤去工事費用を申請する場合は、工事看板及び水廻りを有する建物の外周とその付近の地面についても写っているか。"]
[null,{"$f":"ASC(CONCATENATE(入力!G4,入力!H4,入力!I4,入力!J4))","v":"月日"},"工事看板の設置場所・補助事業者名・交付決定日及び交付決定番号に誤りはないか。"]
[null,{"$f":"\"第\"&ASC(入力!G5)&\"号\"","v":"第号"},"浄化槽設備士は、ヘルメットをかぶり、正面を向いて、人物が特定できるか。"]
{"$rows_left_out":44}
{"sheet":"交付請求書","index":11,"n_rows":30,"n_cols":12,"rows_kept":30,"cut":false,"hidden":false,"merged":[[32,1,32,10],[33,3,33,4],[35,3,35,9],[21,1,21,15],[23,1,23,15],[27,1,27,15],[29,3,29,4],[29,7,29,10],[31,3,31,4],[19,1,19,15],[3,1,3,15],[12,11,13,15],[15,11,15,15],[6,10,6,16]]}
[null,"様式第７号（第１１条関係）"]
[]
[]
[null,"補　助　金　交　付　請　求　書"]
[]
[]
{"$rows_left_out":25}
{"sheet":"口振依頼書","index":12,"n_rows":48,"n_cols":52,"rows_kept":48,"cut":false,"hidden":false,"merged":[[21,18,21,40],[47,3,49,51],[42,46,43,47],[42,48,43,49],[42,50,43,51],[40,46,40,47],[40,48,40,49],[40,50,40,51],[40,44,40,45],[24,1,26,54],[28,0,28,9],[29,0,29,53],[17,1,21,9],[17,12,17,13],[19,13,19,16],[42,52,43,53],[44,20,46,29],[44,38,46,53],[42,28,43,29],[42,30,43,37],[42,38,43,39],[42,40,43,41],[42,42,43,43],[42,44,43,45],[40,52,40,53],[42,2,43,10],[42,13,43,18],[42,20,43,21],[42,22,43,23],[42,24,43,25],[42,26,43,27],[31,1,40,11],[32,31,38,33],[34,51,34,52],[36,51,36,52],[40,12,40,18],[40,19,40,31],[40,32,40,39],[40,40,40,41],[40,42,40,43],[4,49,4,50],[4,51,4,52],[4,47,4,48],[17,14,17,18],[17,20,17,25],[31,12,39,29],[31,35,39,49],[2,13,2,38],[4,38,4,40],[4,41,4,42],[4,43,4,44],[4,45,4,46],[6,3,6,14],[8,2,8,53],[11,1,14,9],[11,12,11,17],[11,21,11,52],[14,12,14,17],[14,21,14,52],[19,18,19,53],[20,18,20,45]]}
[]
[]
[null,null,null,null,null,null,null,null,null,null,null,null,null,"口座振込依頼書"]
[null,null,null,null," "]
[null,null,null,null,null,null,null,null,null,null,null,null,null,null,null,null,null,null,null,null,null,null,null,null,null,null,null,null,null,null,null,null,null,null,null,null,null,null,"令和",null,null,null,null,"年",null,null,null,"月",null,null,null,"日"]
[]
{"$rows_left_out":43}
{"sheet":"変更等承認","index":13,"n_rows":36,"n_cols":20,"rows_kept":36,"cut":false,"hidden":false,"merged":[[29,2,29,9],[30,2,30,9],[29,10,29,19],[30,10,30,19],[3,1,3,19],[23,1,23,19],[11,15,13,19],[6,12,6,19],[14,15,14,19],[20,0,20,19],[36,2,41,19],[18,0,18,19],[25,2,25,9],[35,2,35,7],[16,8,16,9],[16,17,16,18],[32,2,32,19],[34,2,34,19],[16,2,16,3],[16,11,16,16],[16,5,16,6],[16,0,16,1],[25,11,25,15],[33,10,33,13],[28,2,28,9],[28,10,28,19]]}
[null,"様式第４号（第８条関係）"]
[]
[]
[null,"変　更　等　承　認　申　請　書"]
[]
[]
{"$rows_left_out":31}
{"sheet":"移管データ","index":14,"n_rows":2,"n_cols":75,"rows_kept":2,"cut":false,"hidden":false,"merged":[]}
["交付番号","年度","受付月","名前","名前(外字使わない)","読み","町名","山上対策地域","人槽","但書適用前人槽","既設","実使用人員","型式","メ－カ－","申請者住所","住所２","新要綱該当事由","新要綱確認書類","〒′","地番","下水計画区域","申請手続","業者No.","工事業者","設備士","物件","確認届出区分","完成予定日","届出日","施工協受付NO","申請仮受付","申請受付","設置補助額","配管補助額","補助額","支出残","設置分国庫額","配管補助","条件","起案日","交付決定日","実績報告","保証登録番号","額確定起案日","額確定","会計送達日","審査日","振込日","備考","番号","設置場所","NO（設置場所一致）","場所（設置場所一致）","名前（設置場所一致）","NO（名前一致）","場所（名前一致）","名前（名前一致）","変更承認受付日","変更承認起案日","変更承認決裁日","理由","ﾌﾞﾛﾜｰ型式","振込先連絡有無","振込金融機関名","口座番号","振込先備考","国補区分","総事業費","本体価格","埋設工事費","面積１","面積２","面積２の用途","提出予定日","台所升の油脂"]
[null,null,null,{"$f":"DBCS(入力!C9)","v":""},{"$f":"DBCS(入力!C9)","v":""},{"$f":"DBCS(PHONETIC(入力!C8))","v":""},{"$f":"DBCS(入力!C30)","v":""},{"$f":"IF(COUNTIF(【編集不可】マスタ!H2:H9,入力!C30),\"山上\",\"　\")","v":"　"},{"$f":"ASC(入力!C49)","v":""},{"$f":"ASC(IF(入力!C48=入力!C49,\"不適用\",入力!C48))","v":"不適用"},null,{"$f":"ASC(入力!C42)","v":""},{"$f":"ASC(入力!C47)","v":""},{"$f":"ASC(入力!C46)","v":""},{"$f":"IFERROR((IF(FIND(\"　\",DBCS(入力!C7),1)>0, DBCS(LEFT(入力!C7,FIND(\"　\",入力!C7,1)-1)),入力!C7)),\"\")","v":""},{"$f":"ASC(RIGHT(入力!C7,LEN(入力!C7)-FIND(\"　\",入力!C7,1)))","v":{"$error":"#VALUE!"}},{"$f":"IF(入力!C17=0,入力!C15,入力!C15&\"，\"&入力!C17)","v":0},null,{"$f":"ASC(入力!C6)","v":""},{"$f":"DBCS(入力!K34)","v":""},null,{"$f":"ASC(SUBSTITUTE(SUBSTITUTE(入力!C66,\"有限会社\",\"(有)\"),\"株式会社\",\"(株)\"))","v":""},{"$f":"IF(入力!C74=\"登録\",\"T\",\"\")&IF(入力!C74=\"届出\",\"K\",\"\")&ASC(入力!H74)","v":""},{"$f":"ASC(SUBSTITUTE(SUBSTITUTE(入力!C72,\"有限会社\",\"(有)\"),\"株式会社\",\"(株)\"))","v":""},{"$f":"IFERROR((IF(FIND(\"　\",DBCS(入力!C75),1)>0, DBCS(LEFT(入力!C75,FIND(\"　\",入力!C75,1)-1)),入力!C75)),\"\")","v":""},null,{"$f":"IF(入力!C11=\"建築確認\",\"確認\",\"\")&IF(入力!C11=\"設置届出\",\"届出\",\"\")","v":""},{"$f":"ASC(\"R\"&(IF(入力!C61<4,入力!C2+1,入力!C2)&\"/\"&入力!C61&\"/\"&入力!E61))","v":"R8//"},null,null,null,null,{"$f":"IFERROR('見積額調書(提出不要・削除禁止)'!AM10,\"\")","v":0},{"$f":"IFERROR('見積額調書(提出不要・削除禁止)'!AM14,\"\")","v":0},{"$f":"IFERROR(交付申請書!X41/1000,\"\")","v":0},null,null,{"$f":"IF(AH2=0,\"\",\"配管補助あり\")","v":""},null,null,null,{"$f":"IF(入力!G3=0,\"\",入力!G3)","v":""},null,null,null,null,null,null,null,null,{"$f":"DBCS(G2&T2)","v":""},null,null,null,null,null,null,null,null,null,null,{"$f":"ASC(入力!G54)","v":""},null,null,null,null,null,{"$f":"IF(入力!G55=0,入力!C55,入力!G55)","v":0},{"$f":"入力!G56","v":0},{"$f":"入力!G57","v":0},{"$f":"入力!C38","v":0},{"$f":"IF(入力!C39=0,\"\",入力!C39)","v":""},{"$f":"IF(入力!F36=0,\"\",入力!F36)","v":""}]

{"sheet":"見積額調書(提出不要・削除禁止)","index":15,"n_rows":54,"n_cols":50,"rows_kept":54,"cut":false,"hidden":false,"merged":[[9,35,10,37],[0,0,1,9],[3,14,4,36],[7,13,7,23],[7,26,7,36],[9,25,10,34],[7,39,7,50],[9,38,10,48],[9,49,10,51],[12,0,12,11],[12,16,12,20],[12,29,12,33],[12,43,12,46],[11,13,11,23],[11,26,11,36],[11,39,11,50],[8,1,9,10],[8,16,8,20],[8,29,8,33],[8,43,8,46],[9,12,10,21],[9,22,10,24],[13,1,13,10],[13,12,14,21],[13,22,14,24],[13,25,14,34],[13,35,14,37],[13,38,14,48],[13,49,14,51],[15,13,15,23],[15,26,15,36],[15,39,15,50],[16,0,16,11],[16,16,16,20],[16,29,16,33],[16,43,16,46],[25,4,25,18],[17,1,17,10],[17,12,18,21],[17,22,18,24],[17,25,18,34],[17,49,18,51],[21,4,21,12],[21,30,21,33],[23,4,23,12],[23,25,23,38],[17,35,18,37],[17,38,18,48],[27,7,27,24],[27,33,27,45],[27,46,27,47],[29,7,29,17],[29,33,29,45],[29,46,29,47],[31,7,31,19],[31,33,31,45],[31,46,31,47],[33,7,33,19],[33,33,33,45],[33,46,33,47],[35,7,35,14],[35,33,35,45],[35,46,35,47],[38,21,38,26],[38,33,38,45],[38,46,38,47]]}
["（第６条関係）"]
[]
[]
[null,null,null,null,null,null,null,null,null,null,null,null,null,null,"補助金見積額調書"]
[]
[]
{"$rows_left_out":49}
{"sheet":"収支決算及び実績額(提出不要・削除禁止)","index":16,"n_rows":25,"n_cols":50,"rows_kept":25,"cut":false,"hidden":false,"merged":[[1,1,2,10],[1,16,1,20],[1,29,1,33],[1,43,1,46],[2,12,3,21],[4,13,4,23],[4,26,4,36],[4,39,4,50],[0,13,0,23],[0,26,0,36],[0,39,0,50],[2,22,3,24],[2,25,3,34],[2,35,3,37],[2,38,3,48],[2,49,3,51],[5,0,5,11],[5,16,5,20],[5,29,5,33],[5,43,5,46],[6,1,6,10],[6,12,7,21],[6,22,7,24],[6,25,7,34],[6,35,7,37],[6,38,7,48],[6,49,7,51],[8,13,8,23],[8,26,8,36],[8,39,8,50],[9,0,9,11],[9,16,9,20],[9,29,9,33],[9,43,9,46],[10,49,11,51],[10,1,10,10],[10,12,11,21],[10,22,11,24],[10,25,11,34],[10,35,11,37],[10,38,11,48],[13,7,13,24],[13,33,13,45],[13,46,13,47],[15,7,15,17],[15,33,15,45],[15,46,15,47],[17,7,17,19],[17,33,17,45],[17,46,17,47],[19,7,19,19],[19,33,19,45],[19,46,19,47],[21,7,21,14],[21,33,21,45],[21,46,21,47],[24,21,24,26],[24,33,24,45],[24,46,24,47]]}
[null,null,null,null,null,null,null,null,null,null,null,null,null,"事業費",null,null,null,null,null,null,null,null,null,null,null,null,"補助限度額",null,null,null,null,null,null,null,null,null,null,null,null,"補助金申請額"]
[null,"浄化槽設置分",null,null,null,null,null,null,null,null,null,null,null,null,null,null,"（Ａ）",null,null,null,null,null,null,null,null,null,null,null,null,"（Ｂ）",null,null,null,null,null,null,null,null,null,null,null,null,null,"（Ｃ）"]
[null,null,null,null,null,null,null,null,null,null,null,null,{"$f":"ROUNDDOWN((AH14+AH16)/1000,0)","v":0},null,null,null,null,null,null,null,null,null,"千円",null,null,{"$f":"IF(入力!C49=0,0,ROUNDDOWN((VLOOKUP(入力!C49,【編集不可】マスタ!I2:J44,2,FALSE))/1000,0))","v":0},null,null,null,null,null,null,null,null,null,"千円",null,null,{"$f":"MIN(M3,Z3)","v":0},null,null,null,null,null,null,null,null,null,null,"千円"]
[]
[null,null,null,null,null,null,null,null,null,null,null,null,null,"事業費",null,null,null,null,null,null,null,null,null,null,null,null,"補助限度額",null,null,null,null,null,null,null,null,null,null,null,null,"補助金申請額"]
["単独・汲取り転換",null,null,null,null,null,null,null,null,null,null,null,null,null,null,null,"（Ｄ）",null,null,null,null,null,null,null,null,null,null,null,null,"（Ｅ）",null,null,null,null,null,null,null,null,null,null,null,null,null,"（Ｆ）"]
{"$rows_left_out":20}
{"sheet":"【編集不可】マスタ","index":17,"n_rows":822,"n_cols":21,"rows_kept":822,"cut":false,"hidden":false,"merged":[]}
["No","日にち（月）","日にち（日）","北区地名","中区地名","東区地名","南区地名","山上対策地域","人槽","補助金額(通常)","変更届","委任状","理由書","承諾書","公共物使用許可書","種類","放流先","所有者","消費税","消費税計算（申請）","消費税計算（実績）"]
[1,4,1,"【あ】","【あ】","【あ】","【あ】","日近",5,332000,"配管経路","共有者あり","算定より大きい槽を埋設のため（住民票添付）","他者所有の敷地に浄化槽を埋設する","開発許可なく水路等に排管を新設","一般住宅","側溝","本人","消費税（10％）端数：切上げ",{"$f":"ROUNDUP(+SUM(入力!C56:F59)*10%,0)","v":0},{"$f":"ROUNDUP(+SUM(入力!G56:J59)*10%,0)","v":0}]
[2,5,2,"葵町","赤坂台","浅川","青江六丁目","杉谷",7,414000,"埋設位置",null,"算定より大きい槽を埋設のため（増築予定図面添付）","他者所有の敷地を排水管が経由する",null,"併用住宅","用水路","共有（2人）","消費税（10％）端数：切捨て",{"$f":"ROUNDDOWN(+SUM(入力!C56:F59)*10%,0)","v":0},{"$f":"ROUNDDOWN(+SUM(入力!G56:J59)*10%,0)","v":0}]
[3,6,3,"青江一丁目","赤坂本町","浅越","飽浦","下高田",10,548000,"埋設方向",null,"【その他自由入力】","他者所有の排水路などを使用する",null,null,"排水路","共有（3人）","消費税（10％）端数：四捨五入",{"$f":"ROUND(+SUM(入力!C56:F59)*10%,0)","v":0},{"$f":"ROUND(+SUM(入力!G56:J59)*10%,0)","v":0}]
[4,7,4,"青江二丁目","赤坂南新町","【い】","あけぼの町","吉",11,939000,"埋設位置および埋設方向",null,null,"所有権移転前の申請および設置",null,null,"河川","共有（4人）"]
[5,8,5,"青江三丁目","赤田","犬島","阿津","山上",12,939000,"住所",null,null,"【その他自由入力】",null,null,"その他","他者"]
{"$rows_left_out":817}
{"sheet":"【編集不可】補助要件マスタ","index":18,"n_rows":155,"n_cols":6,"rows_kept":155,"cut":false,"hidden":false,"merged":[[2,3,6,3],[22,2,29,2],[34,2,42,2],[47,2,55,2],[115,5,121,5],[107,4,110,4]]}
["主たる生活の本拠に設置"]
["【はい】","【いいえ】現に居住している","【いいえ】これから居住する"]
["【浄化槽を設置する建物の汚水処理】","【浄化槽を設置する建物の汚水処理】","【浄化槽を設置する建物の汚水処理】","選択肢"]
["無","単独","単独"]
["単独","汲取り","汲取り"]
["汲取り","合併"]
{"$rows_left_out":149}